{"text_format":"1","workbook":"xlsx","n_sheets":10,"sheets":["PERSONAL->","Staff","PROJEKT->","Project","Schedule","BUDGET","DB","ClientMaster","Admin","Holiday&Work day"],"not_rendered":{"charts":0,"images":1,"macros":1,"external_links":0,"defined_names":6,"comments":0,"pivot_tables":5},"unopened":[],"bounds":{"document_bytes":16777216,"sheet_cells":100000,"rows_first":2000,"rows_last":500,"rows_between":2000,"halvings":0,"cell_chars":16384,"cell_head_chars":4096},"cells_cut":0,"cells_raw":0,"read":"whole","date_system":"1900"}

{"sheet":"PERSONAL->","index":0,"n_rows":0,"n_cols":0,"rows_kept":0,"cut":false,"hidden":false,"merged":[]}

{"sheet":"Staff","index":1,"n_rows":41,"n_cols":14,"rows_kept":41,"cut":false,"hidden":false,"merged":[]}
[null,"Need more?... ","Http://exceldepartment.com",null,{"$f":"IF(Admin!$B$10=\"NO\",\"\",IF(Admin!$B$2=\"MONTH\",IF(MONTH(NOW())<>MONTH(Admin!$B$4),\"This is a free version. Contact Exceldepartment for unlocking full potential of the model.\",\"\"),\nIF(Admin!$B$2=\"QRT\",IF(INT((MONTH(NOW())+2)/3)<>INT((MONTH(Admin!$B$4)+2)/3),\"This is a free version. Contact Exceldepartment for unlocking full potential of the model.\",\"\"),\nIF(Admin!$B$2=\"YEAR\",IF(YEAR(NOW())<>YEAR(Admin!$B$4),\"This is a free version. Contact Exceldepartment for unlocking full potential of the model.\",\"\"),\n\"This is a free version. Contact Exceldepartment for unlocking full potential of the model.\"))))","v":"This is a free version. Contact Exceldepartment for unlocking full potential of the model."}]
["StaffSheet","Name","Staff Name Here",null,null,"Main Category Type","STAFF",null,null,null,"Status_DropDown","0_AttentionNeeded",null,"99_discountinued"]
[]
[null,"Description - Short",{"$f":"IFERROR(INDEX(4:4,MATCH(C2,6:6,0)),\"\")","v":""},null,null,null,null,null,null,null,"Agents","LL","IK","GA"]
[]
[null,"Description - Long",null,null,null,null,null,null,null,null,null,"Lukas Lilja","Ivan Kocis","Göran Axelsson"]
[]
[null,"Prio"]
[]
[]
[null,"_People involved"]
[]
[]
[]
[null,"Description of Client"]
[]
[]
[]
[null,"Description of problem"]
[]
[]
[null,"_Name","_Description","_hours","_price"]
[]
[]
[null,"Totalt",null,{"$f":"SUM(D23:D24)","v":0},1250]
[]
[]
[]
[]
[null,"Work"]
["_Key","_Project","_SubProject","_Task","_StartDate","_Hours","_Comment","_Staff","_TotalHoursPerDay","_TotalHours","_HourBalance","_Cost","_ProjectAndSubProject"]
[null,null,null,null,null,null,null,{"$f":"$C$4","v":""},{"$f":"+SUMIFS($G:$G,$F:$F,$E32)","v":0},{"$f":"SUMIFS(ClientMaster!$H:$H,ClientMaster!$F:$F,$N32,ClientMaster!$G:$G,$O32)","v":0},{"$f":"IFERROR(IF(LEFT($N32,3)=\"XLD\",0,$J32-(SUMIFS(ClientMaster!$L:$L,ClientMaster!$J:$J,$N32,ClientMaster!$K:$K,$O32)+IF($A32=\"\",$F32,0))),0)","v":0},null,{"$f":"IF($B32=\"\",\"\",$B32&\"_\"&$C32)","v":""}]
[null,null,null,null,null,null,null,"",{"$f":"+SUMIFS($G:$G,$F:$F,$E33)","v":0},{"$f":"SUMIFS(ClientMaster!$H:$H,ClientMaster!$F:$F,$N33,ClientMaster!$G:$G,$O33)","v":0},{"$f":"IFERROR(IF(LEFT($N33,3)=\"XLD\",0,$J33-(SUMIFS(ClientMaster!$L:$L,ClientMaster!$J:$J,$N33,ClientMaster!$K:$K,$O33)+IF($A33=\"\",$F33,0))),0)","v":0},null,{"$f":"IF($B33=\"\",\"\",$B33&\"_\"&$C33)","v":""}]
[null,null,null,null,null,null,null,"",{"$f":"+SUMIFS($G:$G,$F:$F,$E34)","v":0},{"$f":"SUMIFS(ClientMaster!$H:$H,ClientMaster!$F:$F,$N34,ClientMaster!$G:$G,$O34)","v":0},{"$f":"IFERROR(IF(LEFT($N34,3)=\"XLD\",0,$J34-(SUMIFS(ClientMaster!$L:$L,ClientMaster!$J:$J,$N34,ClientMaster!$K:$K,$O34)+IF($A34=\"\",$F34,0))),0)","v":0},null,{"$f":"IF($B34=\"\",\"\",$B34&\"_\"&$C34)","v":""}]
[]
[]
[null,"Holidays"]
["_Key","_Project","_SubProject","_Task","_Staff","_StartDate","_Description","_Hours","_EndDate","_Comment","_Status","_MainCategory","_Category","_SubCategory"]
[null,null,null,null,{"$f":"$C$4","v":""}]
[null,null,null,null,""]
[null,null,null,null,""]

{"sheet":"PROJEKT->","index":2,"n_rows":0,"n_cols":0,"rows_kept":0,"cut":false,"hidden":false,"merged":[]}

{"sheet":"Project","index":3,"n_rows":47,"n_cols":14,"rows_kept":47,"cut":false,"hidden":false,"merged":[]}
[null,"Need more?... ","Http://exceldepartment.com",null,{"$f":"IF(Admin!$B$10=\"NO\",\"\",IF(Admin!$B$2=\"MONTH\",IF(MONTH(NOW())<>MONTH(Admin!$B$4),\"This is a free version. Contact Exceldepartment for unlocking full potential of the model.\",\"\"),\nIF(Admin!$B$2=\"QRT\",IF(INT((MONTH(NOW())+2)/3)<>INT((MONTH(Admin!$B$4)+2)/3),\"This is a free version. Contact Exceldepartment for unlocking full potential of the model.\",\"\"),\nIF(Admin!$B$2=\"YEAR\",IF(YEAR(NOW())<>YEAR(Admin!$B$4),\"This is a free version. Contact Exceldepartment for unlocking full potential of the model.\",\"\"),\n\"This is a free version. Contact Exceldepartment for unlocking full potential of the model.\"))))","v":"This is a free version. Contact Exceldepartment for unlocking full potential of the model."}]
["ProjectSheet","Name","Client Name Here",null,null,"Main Category Type","XLD_PROJECT"]
[]
[null,"Description - Short"]
[]
[null,"Description - Long"]
[]
[null,"Prio"]
[]
[]
["_Key","_SubCategory","_Description","_hours","_Comment","_Prio","_Category","_Staff","_startDate","_endDate","_Status"]
[null,"CurrentStatus",null,0,null,null,"CurrentStatus",null,{"$f":"TODAY()","v":"2023-10-24"},{"$f":"I12","v":"2023-10-24"},"1_Assigned"]
[null,"Second In Command",null,0,null,null,"CurrentStatus",null,{"$f":"TODAY()","v":"2023-10-24"},{"$f":"I13","v":"2023-10-24"},"1_Assigned"]
[null,"BillingDetails",null,0,null,null,"CurrentStatus",null,{"$f":"TODAY()","v":"2023-10-24"},{"$f":"I14","v":"2023-10-24"},"1_Assigned"]
[]
[null,"_People involved"]
[]
[]
[]
[null,"Description of Client"]
[]
[]
[]
[]
[null,"Description of problem"]
[]
[]
[]
[]
[]
[]
[]
[]
[]
[]
[]
["_Key","_Project","_SubProject","_Task","_Staff","_Status","_Hours","_StartDate","_EndDate","_Description","_MainCategory","_Category","_SubCategory","_Comment"]
[null,{"$f":"$C$2","v":"Client Name Here"},null,null,null,null," "]
[null,{"$f":"$C$2","v":"Client Name Here"},null,null,null,null," "]
[null,"Client Name Here",null,null,null,null," "]
[]
[]
[]
["_Key","_Project","_SubProject","_Task","_Staff","_Status","_Hours","_StartDate","_EndDate","_Description","_MainCategory","_Category","_SubCategory","_Comment"]
[null,{"$f":"$C$2","v":"Client Name Here"},null,null,null,null," "]
[null,"Client Name Here",null,null,null,null," "]
[null,"Client Name Here",null,null,null,null," "]

{"sheet":"Schedule","index":4,"n_rows":10,"n_cols":60,"rows_kept":10,"cut":false,"hidden":false,"merged":[]}
[null,"Need more?... ","Http://exceldepartment.com","Active User",null,null,null,null,null,null,null,null,null,null,null,"LL",{"$f":"SUM(R1:W1)","v":0},{"$f":"SUMIFS(INDEX(R:R,11):INDEX(R:R,100000),INDEX($F:$F,11):INDEX($F:$F,100000),$P1,INDEX($J:$J,11):INDEX($J:$J,100000),\"0_AttentionNeeded\")\n+SUMIFS(INDEX(R:R,11):INDEX(R:R,100000),INDEX($F:$F,11):INDEX($F:$F,100000),$P1,INDEX($J:$J,11):INDEX($J:$J,100000),\"1_Assigned\")\n+SUMIFS(INDEX(R:R,11):INDEX(R:R,100000),INDEX($F:$F,11):INDEX($F:$F,100000),$P1,INDEX($J:$J,11):INDEX($J:$J,100000),\"2_InProgress\")\n+SUMIFS(INDEX(R:R,11):INDEX(R:R,100000),INDEX($F:$F,11):INDEX($F:$F,100000),$P1,INDEX($J:$J,11):INDEX($J:$J,100000),\"3_Prototype\")\n+SUMIFS(INDEX(R:R,11):INDEX(R:R,100000),INDEX($F:$F,11):INDEX($F:$F,100000),$P1,INDEX($J:$J,11):INDEX($J:$J,100000),\"4_Testing\")","v":0},{"$f":"SUMIFS(INDEX(S:S,11):INDEX(S:S,100000),INDEX($F:$F,11):INDEX($F:$F,100000),$P1,INDEX($J:$J,11):INDEX($J:$J,100000),\"0_AttentionNeeded\")\n+SUMIFS(INDEX(S:S,11):INDEX(S:S,100000),INDEX($F:$F,11):INDEX($F:$F,100000),$P1,INDEX($J:$J,11):INDEX($J:$J,100000),\"1_Assigned\")\n+SUMIFS(INDEX(S:S,11):INDEX(S:S,100000),INDEX($F:$F,11):INDEX($F:$F,100000),$P1,INDEX($J:$J,11):INDEX($J:$J,100000),\"2_InProgress\")\n+SUMIFS(INDEX(S:S,11):INDEX(S:S,100000),INDEX($F:$F,11):INDEX($F:$F,100000),$P1,INDEX($J:$J,11):INDEX($J:$J,100000),\"3_Prototype\")\n+SUMIFS(INDEX(S:S,11):INDEX(S:S,100000),INDEX($F:$F,11):INDEX($F:$F,100000),$P1,INDEX($J:$J,11):INDEX($J:$J,100000),\"4_Testing\")","v":0},{"$f":"SUMIFS(INDEX(T:T,11):INDEX(T:T,100000),INDEX($F:$F,11):INDEX($F:$F,100000),$P1,INDEX($J:$J,11):INDEX($J:$J,100000),\"0_AttentionNeeded\")\n+SUMIFS(INDEX(T:T,11):INDEX(T:T,100000),INDEX($F:$F,11):INDEX($F:$F,100000),$P1,INDEX($J:$J,11):INDEX($J:$J,100000),\"1_Assigned\")\n+SUMIFS(INDEX(T:T,11):INDEX(T:T,100000),INDEX($F:$F,11):INDEX($F:$F,100000),$P1,INDEX($J:$J,11):INDEX($J:$J,100000),\"2_InProgress\")\n+SUMIFS(INDEX(T:T,11):INDEX(T:T,100000),INDEX($F:$F,11):INDEX($F:$F,100000),$P1,INDEX($J:$J,11):INDEX($J:$J,100000),\"3_Prototype\")\n+SUMIFS(INDEX(T:T,11):INDEX(T:T,100000),INDEX($F:$F,11):INDEX($F:$F,100000),$P1,INDEX($J:$J,11):INDEX($J:$J,100000),\"4_Testing\")","v":0},{"$f":"SUMIFS(INDEX(U:U,11):INDEX(U:U,100000),INDEX($F:$F,11):INDEX($F:$F,100000),$P1,INDEX($J:$J,11):INDEX($J:$J,100000),\"0_AttentionNeeded\")\n+SUMIFS(INDEX(U:U,11):INDEX(U:U,100000),INDEX($F:$F,11):INDEX($F:$F,100000),$P1,INDEX($J:$J,11):INDEX($J:$J,100000),\"1_Assigned\")\n+SUMIFS(INDEX(U:U,11):INDEX(U:U,100000),INDEX($F:$F,11):INDEX($F:$F,100000),$P1,INDEX($J:$J,11):INDEX($J:$J,100000),\"2_InProgress\")\n+SUMIFS(INDEX(U:U,11):INDEX(U:U,100000),INDEX($F:$F,11):INDEX($F:$F,100000),$P1,INDEX($J:$J,11):INDEX($J:$J,100000),\"3_Prototype\")\n+SUMIFS(INDEX(U:U,11):INDEX(U:U,100000),INDEX($F:$F,11):INDEX($F:$F,100000),$P1,INDEX($J:$J,11):INDEX($J:$J,100000),\"4_Testing\")","v":0},{"$f":"SUMIFS(INDEX(V:V,11):INDEX(V:V,100000),INDEX($F:$F,11):INDEX($F:$F,100000),$P1,INDEX($J:$J,11):INDEX($J:$J,100000),\"0_AttentionNeeded\")\n+SUMIFS(INDEX(V:V,11):INDEX(V:V,100000),INDEX($F:$F,11):INDEX($F:$F,100000),$P1,INDEX($J:$J,11):INDEX($J:$J,100000),\"1_Assigned\")\n+SUMIFS(INDEX(V:V,11):INDEX(V:V,100000),INDEX($F:$F,11):INDEX($F:$F,100000),$P1,INDEX($J:$J,11):INDEX($J:$J,100000),\"2_InProgress\")\n+SUMIFS(INDEX(V:V,11):INDEX(V:V,100000),INDEX($F:$F,11):INDEX($F:$F,100000),$P1,INDEX($J:$J,11):INDEX($J:$J,100000),\"3_Prototype\")\n+SUMIFS(INDEX(V:V,11):INDEX(V:V,100000),INDEX($F:$F,11):INDEX($F:$F,100000),$P1,INDEX($J:$J,11):INDEX($J:$J,100000),\"4_Testing\")","v":0},{"$f":"SUMIFS(INDEX(W:W,11):INDEX(W:W,100000),INDEX($F:$F,11):INDEX($F:$F,100000),$P1,INDEX($J:$J,11):INDEX($J:$J,100000),\"0_AttentionNeeded\")\n+SUMIFS(INDEX(W:W,11):INDEX(W:W,100000),INDEX($F:$F,11):INDEX($F:$F,100000),$P1,INDEX($J:$J,11):INDEX($J:$J,100000),\"1_Assigned\")\n+SUMIFS(INDEX(W:W,11):INDEX(W:W,100000),INDEX($F:$F,11):INDEX($F:$F,100000),$P1,INDEX($J:$J,11):INDEX($J:$J,100000),\"2_InProgress\")\n+SUMIFS(INDEX(W:W,11):INDEX(W:W,100000),INDEX($F:$F,11):INDEX($F:$F,100000),$P1,INDEX($J:$J,11):INDEX($J:$J,100000),\"3_Prototype\")\n+SUMIFS(INDEX(W:W,11):INDEX(W:W,100000),INDEX($F:$F,11):INDEX($F:$F,100000),$P1,INDEX($J:$J,11):INDEX($J:$J,100000),\"4_Testing\")","v":0},{"$f":"SUM(Y1:AD1)","v":0},{"$f":"SUMIFS(INDEX(Y:Y,11):INDEX(Y:Y,100000),INDEX($F:$F,11):INDEX($F:$F,100000),$P1,INDEX($J:$J,11):INDEX($J:$J,100000),\"0_AttentionNeeded\")\n+SUMIFS(INDEX(Y:Y,11):INDEX(Y:Y,100000),INDEX($F:$F,11):INDEX($F:$F,100000),$P1,INDEX($J:$J,11):INDEX($J:$J,100000),\"1_Assigned\")\n+SUMIFS(INDEX(Y:Y,11):INDEX(Y:Y,100000),INDEX($F:$F,11):INDEX($F:$F,100000),$P1,INDEX($J:$J,11):INDEX($J:$J,100000),\"2_InProgress\")\n+SUMIFS(INDEX(Y:Y,11):INDEX(Y:Y,100000),INDEX($F:$F,11):INDEX($F:$F,100000),$P1,INDEX($J:$J,11):INDEX($J:$J,100000),\"3_Prototype\")\n+SUMIFS(INDEX(Y:Y,11):INDEX(Y:Y,100000),INDEX($F:$F,11):INDEX($F:$F,100000),$P1,INDEX($J:$J,11):INDEX($J:$J,100000),\"4_Testing\")","v":0},{"$f":"SUMIFS(INDEX(Z:Z,11):INDEX(Z:Z,100000),INDEX($F:$F,11):INDEX($F:$F,100000),$P1,INDEX($J:$J,11):INDEX($J:$J,100000),\"0_AttentionNeeded\")\n+SUMIFS(INDEX(Z:Z,11):INDEX(Z:Z,100000),INDEX($F:$F,11):INDEX($F:$F,100000),$P1,INDEX($J:$J,11):INDEX($J:$J,100000),\"1_Assigned\")\n+SUMIFS(INDEX(Z:Z,11):INDEX(Z:Z,100000),INDEX($F:$F,11):INDEX($F:$F,100000),$P1,INDEX($J:$J,11):INDEX($J:$J,100000),\"2_InProgress\")\n+SUMIFS(INDEX(Z:Z,11):INDEX(Z:Z,100000),INDEX($F:$F,11):INDEX($F:$F,100000),$P1,INDEX($J:$J,11):INDEX($J:$J,100000),\"3_Prototype\")\n+SUMIFS(INDEX(Z:Z,11):INDEX(Z:Z,100000),INDEX($F:$F,11):INDEX($F:$F,100000),$P1,INDEX($J:$J,11):INDEX($J:$J,100000),\"4_Testing\")","v":0},{"$f":"SUMIFS(INDEX(AA:AA,11):INDEX(AA:AA,100000),INDEX($F:$F,11):INDEX($F:$F,100000),$P1,INDEX($J:$J,11):INDEX($J:$J,100000),\"0_AttentionNeeded\")\n+SUMIFS(INDEX(AA:AA,11):INDEX(AA:AA,100000),INDEX($F:$F,11):INDEX($F:$F,100000),$P1,INDEX($J:$J,11):INDEX($J:$J,100000),\"1_Assigned\")\n+SUMIFS(INDEX(AA:AA,11):INDEX(AA:AA,100000),INDEX($F:$F,11):INDEX($F:$F,100000),$P1,INDEX($J:$J,11):INDEX($J:$J,100000),\"2_InProgress\")\n+SUMIFS(INDEX(AA:AA,11):INDEX(AA:AA,100000),INDEX($F:$F,11):INDEX($F:$F,100000),$P1,INDEX($J:$J,11):INDEX($J:$J,100000),\"3_Prototype\")\n+SUMIFS(INDEX(AA:AA,11):INDEX(AA:AA,100000),INDEX($F:$F,11):INDEX($F:$F,100000),$P1,INDEX($J:$J,11):INDEX($J:$J,100000),\"4_Testing\")","v":0},{"$f":"SUMIFS(INDEX(AB:AB,11):INDEX(AB:AB,100000),INDEX($F:$F,11):INDEX($F:$F,100000),$P1,INDEX($J:$J,11):INDEX($J:$J,100000),\"0_AttentionNeeded\")\n+SUMIFS(INDEX(AB:AB,11):INDEX(AB:AB,100000),INDEX($F:$F,11):INDEX($F:$F,100000),$P1,INDEX($J:$J,11):INDEX($J:$J,100000),\"1_Assigned\")\n+SUMIFS(INDEX(AB:AB,11):INDEX(AB:AB,100000),INDEX($F:$F,11):INDEX($F:$F,100000),$P1,INDEX($J:$J,11):INDEX($J:$J,100000),\"2_InProgress\")\n+SUMIFS(INDEX(AB:AB,11):INDEX(AB:AB,100000),INDEX($F:$F,11):INDEX($F:$F,100000),$P1,INDEX($J:$J,11):INDEX($J:$J,100000),\"3_Prototype\")\n+SUMIFS(INDEX(AB:AB,11):INDEX(AB:AB,100000),INDEX($F:$F,11):INDEX($F:$F,100000),$P1,INDEX($J:$J,11):INDEX($J:$J,100000),\"4_Testing\")","v":0},{"$f":"SUMIFS(INDEX(AC:AC,11):INDEX(AC:AC,100000),INDEX($F:$F,11):INDEX($F:$F,100000),$P1,INDEX($J:$J,11):INDEX($J:$J,100000),\"0_AttentionNeeded\")\n+SUMIFS(INDEX(AC:AC,11):INDEX(AC:AC,100000),INDEX($F:$F,11):INDEX($F:$F,100000),$P1,INDEX($J:$J,11):INDEX($J:$J,100000),\"1_Assigned\")\n+SUMIFS(INDEX(AC:AC,11):INDEX(AC:AC,100000),INDEX($F:$F,11):INDEX($F:$F,100000),$P1,INDEX($J:$J,11):INDEX($J:$J,100000),\"2_InProgress\")\n+SUMIFS(INDEX(AC:AC,11):INDEX(AC:AC,100000),INDEX($F:$F,11):INDEX($F:$F,100000),$P1,INDEX($J:$J,11):INDEX($J:$J,100000),\"3_Prototype\")\n+SUMIFS(INDEX(AC:AC,11):INDEX(AC:AC,100000),INDEX($F:$F,11):INDEX($F:$F,100000),$P1,INDEX($J:$J,11):INDEX($J:$J,100000),\"4_Testing\")","v":0},{"$f":"SUMIFS(INDEX(AD:AD,11):INDEX(AD:AD,100000),INDEX($F:$F,11):INDEX($F:$F,100000),$P1,INDEX($J:$J,11):INDEX($J:$J,100000),\"0_AttentionNeeded\")\n+SUMIFS(INDEX(AD:AD,11):INDEX(AD:AD,100000),INDEX($F:$F,11):INDEX($F:$F,100000),$P1,INDEX($J:$J,11):INDEX($J:$J,100000),\"1_Assigned\")\n+SUMIFS(INDEX(AD:AD,11):INDEX(AD:AD,100000),INDEX($F:$F,11):INDEX($F:$F,100000),$P1,INDEX($J:$J,11):INDEX($J:$J,100000),\"2_InProgress\")\n+SUMIFS(INDEX(AD:AD,11):INDEX(AD:AD,100000),INDEX($F:$F,11):INDEX($F:$F,100000),$P1,INDEX($J:$J,11):INDEX($J:$J,100000),\"3_Prototype\")\n+SUMIFS(INDEX(AD:AD,11):INDEX(AD:AD,100000),INDEX($F:$F,11):INDEX($F:$F,100000),$P1,INDEX($J:$J,11):INDEX($J:$J,100000),\"4_Testing\")","v":0},{"$f":"SUM(AF1:AK1)","v":0},{"$f":"SUMIFS(INDEX(AF:AF,11):INDEX(AF:AF,100000),INDEX($F:$F,11):INDEX($F:$F,100000),$P1,INDEX($J:$J,11):INDEX($J:$J,100000),\"0_AttentionNeeded\")\n+SUMIFS(INDEX(AF:AF,11):INDEX(AF:AF,100000),INDEX($F:$F,11):INDEX($F:$F,100000),$P1,INDEX($J:$J,11):INDEX($J:$J,100000),\"1_Assigned\")\n+SUMIFS(INDEX(AF:AF,11):INDEX(AF:AF,100000),INDEX($F:$F,11):INDEX($F:$F,100000),$P1,INDEX($J:$J,11):INDEX($J:$J,100000),\"2_InProgress\")\n+SUMIFS(INDEX(AF:AF,11):INDEX(AF:AF,100000),INDEX($F:$F,11):INDEX($F:$F,100000),$P1,INDEX($J:$J,11):INDEX($J:$J,100000),\"3_Prototype\")\n+SUMIFS(INDEX(AF:AF,11):INDEX(AF:AF,100000),INDEX($F:$F,11):INDEX($F:$F,100000),$P1,INDEX($J:$J,11):INDEX($J:$J,100000),\"4_Testing\")","v":0},{"$f":"SUMIFS(INDEX(AG:AG,11):INDEX(AG:AG,100000),INDEX($F:$F,11):INDEX($F:$F,100000),$P1,INDEX($J:$J,11):INDEX($J:$J,100000),\"0_AttentionNeeded\")\n+SUMIFS(INDEX(AG:AG,11):INDEX(AG:AG,100000),INDEX($F:$F,11):INDEX($F:$F,100000),$P1,INDEX($J:$J,11):INDEX($J:$J,100000),\"1_Assigned\")\n+SUMIFS(INDEX(AG:AG,11):INDEX(AG:AG,100000),INDEX($F:$F,11):INDEX($F:$F,100000),$P1,INDEX($J:$J,11):INDEX($J:$J,100000),\"2_InProgress\")\n+SUMIFS(INDEX(AG:AG,11):INDEX(AG:AG,100000),INDEX($F:$F,11):INDEX($F:$F,100000),$P1,INDEX($J:$J,11):INDEX($J:$J,100000),\"3_Prototype\")\n+SUMIFS(INDEX(AG:AG,11):INDEX(AG:AG,100000),INDEX($F:$F,11):INDEX($F:$F,100000),$P1,INDEX($J:$J,11):INDEX($J:$J,100000),\"4_Testing\")","v":0},{"$f":"SUMIFS(INDEX(AH:AH,11):INDEX(AH:AH,100000),INDEX($F:$F,11):INDEX($F:$F,100000),$P1,INDEX($J:$J,11):INDEX($J:$J,100000),\"0_AttentionNeeded\")\n+SUMIFS(INDEX(AH:AH,11):INDEX(AH:AH,100000),INDEX($F:$F,11):INDEX($F:$F,100000),$P1,INDEX($J:$J,11):INDEX($J:$J,100000),\"1_Assigned\")\n+SUMIFS(INDEX(AH:AH,11):INDEX(AH:AH,100000),INDEX($F:$F,11):INDEX($F:$F,100000),$P1,INDEX($J:$J,11):INDEX($J:$J,100000),\"2_InProgress\")\n+SUMIFS(INDEX(AH:AH,11):INDEX(AH:AH,100000),INDEX($F:$F,11):INDEX($F:$F,100000),$P1,INDEX($J:$J,11):INDEX($J:$J,100000),\"3_Prototype\")\n+SUMIFS(INDEX(AH:AH,11):INDEX(AH:AH,100000),INDEX($F:$F,11):INDEX($F:$F,100000),$P1,INDEX($J:$J,11):INDEX($J:$J,100000),\"4_Testing\")","v":0},{"$f":"SUMIFS(INDEX(AI:AI,11):INDEX(AI:AI,100000),INDEX($F:$F,11):INDEX($F:$F,100000),$P1,INDEX($J:$J,11):INDEX($J:$J,100000),\"0_AttentionNeeded\")\n+SUMIFS(INDEX(AI:AI,11):INDEX(AI:AI,100000),INDEX($F:$F,11):INDEX($F:$F,100000),$P1,INDEX($J:$J,11):INDEX($J:$J,100000),\"1_Assigned\")\n+SUMIFS(INDEX(AI:AI,11):INDEX(AI:AI,100000),INDEX($F:$F,11):INDEX($F:$F,100000),$P1,INDEX($J:$J,11):INDEX($J:$J,100000),\"2_InProgress\")\n+SUMIFS(INDEX(AI:AI,11):INDEX(AI:AI,100000),INDEX($F:$F,11):INDEX($F:$F,100000),$P1,INDEX($J:$J,11):INDEX($J:$J,100000),\"3_Prototype\")\n+SUMIFS(INDEX(AI:AI,11):INDEX(AI:AI,100000),INDEX($F:$F,11):INDEX($F:$F,100000),$P1,INDEX($J:$J,11):INDEX($J:$J,100000),\"4_Testing\")","v":0},{"$f":"SUMIFS(INDEX(AJ:AJ,11):INDEX(AJ:AJ,100000),INDEX($F:$F,11):INDEX($F:$F,100000),$P1,INDEX($J:$J,11):INDEX($J:$J,100000),\"0_AttentionNeeded\")\n+SUMIFS(INDEX(AJ:AJ,11):INDEX(AJ:AJ,100000),INDEX($F:$F,11):INDEX($F:$F,100000),$P1,INDEX($J:$J,11):INDEX($J:$J,100000),\"1_Assigned\")\n+SUMIFS(INDEX(AJ:AJ,11):INDEX(AJ:AJ,100000),INDEX($F:$F,11):INDEX($F:$F,100000),$P1,INDEX($J:$J,11):INDEX($J:$J,100000),\"2_InProgress\")\n+SUMIFS(INDEX(AJ:AJ,11):INDEX(AJ:AJ,100000),INDEX($F:$F,11):INDEX($F:$F,100000),$P1,INDEX($J:$J,11):INDEX($J:$J,100000),\"3_Prototype\")\n+SUMIFS(INDEX(AJ:AJ,11):INDEX(AJ:AJ,100000),INDEX($F:$F,11):INDEX($F:$F,100000),$P1,INDEX($J:$J,11):INDEX($J:$J,100000),\"4_Testing\")","v":0},{"$f":"SUMIFS(INDEX(AK:AK,11):INDEX(AK:AK,100000),INDEX($F:$F,11):INDEX($F:$F,100000),$P1,INDEX($J:$J,11):INDEX($J:$J,100000),\"0_AttentionNeeded\")\n+SUMIFS(INDEX(AK:AK,11):INDEX(AK:AK,100000),INDEX($F:$F,11):INDEX($F:$F,100000),$P1,INDEX($J:$J,11):INDEX($J:$J,100000),\"1_Assigned\")\n+SUMIFS(INDEX(AK:AK,11):INDEX(AK:AK,100000),INDEX($F:$F,11):INDEX($F:$F,100000),$P1,INDEX($J:$J,11):INDEX($J:$J,100000),\"2_InProgress\")\n+SUMIFS(INDEX(AK:AK,11):INDEX(AK:AK,100000),INDEX($F:$F,11):INDEX($F:$F,100000),$P1,INDEX($J:$J,11):INDEX($J:$J,100000),\"3_Prototype\")\n+SUMIFS(INDEX(AK:AK,11):INDEX(AK:AK,100000),INDEX($F:$F,11):INDEX($F:$F,100000),$P1,INDEX($J:$J,11):INDEX($J:$J,100000),\"4_Testing\")","v":0},{"$f":"SUM(AM1:AR1)","v":0},{"$f":"SUMIFS(INDEX(AM:AM,11):INDEX(AM:AM,100000),INDEX($F:$F,11):INDEX($F:$F,100000),$P1,INDEX($J:$J,11):INDEX($J:$J,100000),\"0_AttentionNeeded\")\n+SUMIFS(INDEX(AM:AM,11):INDEX(AM:AM,100000),INDEX($F:$F,11):INDEX($F:$F,100000),$P1,INDEX($J:$J,11):INDEX($J:$J,100000),\"1_Assigned\")\n+SUMIFS(INDEX(AM:AM,11):INDEX(AM:AM,100000),INDEX($F:$F,11):INDEX($F:$F,100000),$P1,INDEX($J:$J,11):INDEX($J:$J,100000),\"2_InProgress\")\n+SUMIFS(INDEX(AM:AM,11):INDEX(AM:AM,100000),INDEX($F:$F,11):INDEX($F:$F,100000),$P1,INDEX($J:$J,11):INDEX($J:$J,100000),\"3_Prototype\")\n+SUMIFS(INDEX(AM:AM,11):INDEX(AM:AM,100000),INDEX($F:$F,11):INDEX($F:$F,100000),$P1,INDEX($J:$J,11):INDEX($J:$J,100000),\"4_Testing\")","v":0},{"$f":"SUMIFS(INDEX(AN:AN,11):INDEX(AN:AN,100000),INDEX($F:$F,11):INDEX($F:$F,100000),$P1,INDEX($J:$J,11):INDEX($J:$J,100000),\"0_AttentionNeeded\")\n+SUMIFS(INDEX(AN:AN,11):INDEX(AN:AN,100000),INDEX($F:$F,11):INDEX($F:$F,100000),$P1,INDEX($J:$J,11):INDEX($J:$J,100000),\"1_Assigned\")\n+SUMIFS(INDEX(AN:AN,11):INDEX(AN:AN,100000),INDEX($F:$F,11):INDEX($F:$F,100000),$P1,INDEX($J:$J,11):INDEX($J:$J,100000),\"2_InProgress\")\n+SUMIFS(INDEX(AN:AN,11):INDEX(AN:AN,100000),INDEX($F:$F,11):INDEX($F:$F,100000),$P1,INDEX($J:$J,11):INDEX($J:$J,100000),\"3_Prototype\")\n+SUMIFS(INDEX(AN:AN,11):INDEX(AN:AN,100000),INDEX($F:$F,11):INDEX($F:$F,100000),$P1,INDEX($J:$J,11):INDEX($J:$J,100000),\"4_Testing\")","v":0},{"$f":"SUMIFS(INDEX(AO:AO,11):INDEX(AO:AO,100000),INDEX($F:$F,11):INDEX($F:$F,100000),$P1,INDEX($J:$J,11):INDEX($J:$J,100000),\"0_AttentionNeeded\")\n+SUMIFS(INDEX(AO:AO,11):INDEX(AO:AO,100000),INDEX($F:$F,11):INDEX($F:$F,100000),$P1,INDEX($J:$J,11):INDEX($J:$J,100000),\"1_Assigned\")\n+SUMIFS(INDEX(AO:AO,11):INDEX(AO:AO,100000),INDEX($F:$F,11):INDEX($F:$F,100000),$P1,INDEX($J:$J,11):INDEX($J:$J,100000),\"2_InProgress\")\n+SUMIFS(INDEX(AO:AO,11):INDEX(AO:AO,100000),INDEX($F:$F,11):INDEX($F:$F,100000),$P1,INDEX($J:$J,11):INDEX($J:$J,100000),\"3_Prototype\")\n+SUMIFS(INDEX(AO:AO,11):INDEX(AO:AO,100000),INDEX($F:$F,11):INDEX($F:$F,100000),$P1,INDEX($J:$J,11):INDEX($J:$J,100000),\"4_Testing\")","v":0},{"$f":"SUMIFS(INDEX(AP:AP,11):INDEX(AP:AP,100000),INDEX($F:$F,11):INDEX($F:$F,100000),$P1,INDEX($J:$J,11):INDEX($J:$J,100000),\"0_AttentionNeeded\")\n+SUMIFS(INDEX(AP:AP,11):INDEX(AP:AP,100000),INDEX($F:$F,11):INDEX($F:$F,100000),$P1,INDEX($J:$J,11):INDEX($J:$J,100000),\"1_Assigned\")\n+SUMIFS(INDEX(AP:AP,11):INDEX(AP:AP,100000),INDEX($F:$F,11):INDEX($F:$F,100000),$P1,INDEX($J:$J,11):INDEX($J:$J,100000),\"2_InProgress\")\n+SUMIFS(INDEX(AP:AP,11):INDEX(AP:AP,100000),INDEX($F:$F,11):INDEX($F:$F,100000),$P1,INDEX($J:$J,11):INDEX($J:$J,100000),\"3_Prototype\")\n+SUMIFS(INDEX(AP:AP,11):INDEX(AP:AP,100000),INDEX($F:$F,11):INDEX($F:$F,100000),$P1,INDEX($J:$J,11):INDEX($J:$J,100000),\"4_Testing\")","v":0},{"$f":"SUMIFS(INDEX(AQ:AQ,11):INDEX(AQ:AQ,100000),INDEX($F:$F,11):INDEX($F:$F,100000),$P1,INDEX($J:$J,11):INDEX($J:$J,100000),\"0_AttentionNeeded\")\n+SUMIFS(INDEX(AQ:AQ,11):INDEX(AQ:AQ,100000),INDEX($F:$F,11):INDEX($F:$F,100000),$P1,INDEX($J:$J,11):INDEX($J:$J,100000),\"1_Assigned\")\n+SUMIFS(INDEX(AQ:AQ,11):INDEX(AQ:AQ,100000),INDEX($F:$F,11):INDEX($F:$F,100000),$P1,INDEX($J:$J,11):INDEX($J:$J,100000),\"2_InProgress\")\n+SUMIFS(INDEX(AQ:AQ,11):INDEX(AQ:AQ,100000),INDEX($F:$F,11):INDEX($F:$F,100000),$P1,INDEX($J:$J,11):INDEX($J:$J,100000),\"3_Prototype\")\n+SUMIFS(INDEX(AQ:AQ,11):INDEX(AQ:AQ,100000),INDEX($F:$F,11):INDEX($F:$F,100000),$P1,INDEX($J:$J,11):INDEX($J:$J,100000),\"4_Testing\")","v":0},{"$f":"SUMIFS(INDEX(AR:AR,11):INDEX(AR:AR,100000),INDEX($F:$F,11):INDEX($F:$F,100000),$P1,INDEX($J:$J,11):INDEX($J:$J,100000),\"0_AttentionNeeded\")\n+SUMIFS(INDEX(AR:AR,11):INDEX(AR:AR,100000),INDEX($F:$F,11):INDEX($F:$F,100000),$P1,INDEX($J:$J,11):INDEX($J:$J,100000),\"1_Assigned\")\n+SUMIFS(INDEX(AR:AR,11):INDEX(AR:AR,100000),INDEX($F:$F,11):INDEX($F:$F,100000),$P1,INDEX($J:$J,11):INDEX($J:$J,100000),\"2_InProgress\")\n+SUMIFS(INDEX(AR:AR,11):INDEX(AR:AR,100000),INDEX($F:$F,11):INDEX($F:$F,100000),$P1,INDEX($J:$J,11):INDEX($J:$J,100000),\"3_Prototype\")\n+SUMIFS(INDEX(AR:AR,11):INDEX(AR:AR,100000),INDEX($F:$F,11):INDEX($F:$F,100000),$P1,INDEX($J:$J,11):INDEX($J:$J,100000),\"4_Testing\")","v":0},{"$f":"SUM(AT1:AY1)","v":0},{"$f":"SUMIFS(INDEX(AT:AT,11):INDEX(AT:AT,100000),INDEX($F:$F,11):INDEX($F:$F,100000),$P1,INDEX($J:$J,11):INDEX($J:$J,100000),\"0_AttentionNeeded\")\n+SUMIFS(INDEX(AT:AT,11):INDEX(AT:AT,100000),INDEX($F:$F,11):INDEX($F:$F,100000),$P1,INDEX($J:$J,11):INDEX($J:$J,100000),\"1_Assigned\")\n+SUMIFS(INDEX(AT:AT,11):INDEX(AT:AT,100000),INDEX($F:$F,11):INDEX($F:$F,100000),$P1,INDEX($J:$J,11):INDEX($J:$J,100000),\"2_InProgress\")\n+SUMIFS(INDEX(AT:AT,11):INDEX(AT:AT,100000),INDEX($F:$F,11):INDEX($F:$F,100000),$P1,INDEX($J:$J,11):INDEX($J:$J,100000),\"3_Prototype\")\n+SUMIFS(INDEX(AT:AT,11):INDEX(AT:AT,100000),INDEX($F:$F,11):INDEX($F:$F,100000),$P1,INDEX($J:$J,11):INDEX($J:$J,100000),\"4_Testing\")","v":0},{"$f":"SUMIFS(INDEX(AU:AU,11):INDEX(AU:AU,100000),INDEX($F:$F,11):INDEX($F:$F,100000),$P1,INDEX($J:$J,11):INDEX($J:$J,100000),\"0_AttentionNeeded\")\n+SUMIFS(INDEX(AU:AU,11):INDEX(AU:AU,100000),INDEX($F:$F,11):INDEX($F:$F,100000),$P1,INDEX($J:$J,11):INDEX($J:$J,100000),\"1_Assigned\")\n+SUMIFS(INDEX(AU:AU,11):INDEX(AU:AU,100000),INDEX($F:$F,11):INDEX($F:$F,100000),$P1,INDEX($J:$J,11):INDEX($J:$J,100000),\"2_InProgress\")\n+SUMIFS(INDEX(AU:AU,11):INDEX(AU:AU,100000),INDEX($F:$F,11):INDEX($F:$F,100000),$P1,INDEX($J:$J,11):INDEX($J:$J,100000),\"3_Prototype\")\n+SUMIFS(INDEX(AU:AU,11):INDEX(AU:AU,100000),INDEX($F:$F,11):INDEX($F:$F,100000),$P1,INDEX($J:$J,11):INDEX($J:$J,100000),\"4_Testing\")","v":0},{"$f":"SUMIFS(INDEX(AV:AV,11):INDEX(AV:AV,100000),INDEX($F:$F,11):INDEX($F:$F,100000),$P1,INDEX($J:$J,11):INDEX($J:$J,100000),\"0_AttentionNeeded\")\n+SUMIFS(INDEX(AV:AV,11):INDEX(AV:AV,100000),INDEX($F:$F,11):INDEX($F:$F,100000),$P1,INDEX($J:$J,11):INDEX($J:$J,100000),\"1_Assigned\")\n+SUMIFS(INDEX(AV:AV,11):INDEX(AV:AV,100000),INDEX($F:$F,11):INDEX($F:$F,100000),$P1,INDEX($J:$J,11):INDEX($J:$J,100000),\"2_InProgress\")\n+SUMIFS(INDEX(AV:AV,11):INDEX(AV:AV,100000),INDEX($F:$F,11):INDEX($F:$F,100000),$P1,INDEX($J:$J,11):INDEX($J:$J,100000),\"3_Prototype\")\n+SUMIFS(INDEX(AV:AV,11):INDEX(AV:AV,100000),INDEX($F:$F,11):INDEX($F:$F,100000),$P1,INDEX($J:$J,11):INDEX($J:$J,100000),\"4_Testing\")","v":0},{"$f":"SUMIFS(INDEX(AW:AW,11):INDEX(AW:AW,100000),INDEX($F:$F,11):INDEX($F:$F,100000),$P1,INDEX($J:$J,11):INDEX($J:$J,100000),\"0_AttentionNeeded\")\n+SUMIFS(INDEX(AW:AW,11):INDEX(AW:AW,100000),INDEX($F:$F,11):INDEX($F:$F,100000),$P1,INDEX($J:$J,11):INDEX($J:$J,100000),\"1_Assigned\")\n+SUMIFS(INDEX(AW:AW,11):INDEX(AW:AW,100000),INDEX($F:$F,11):INDEX($F:$F,100000),$P1,INDEX($J:$J,11):INDEX($J:$J,100000),\"2_InProgress\")\n+SUMIFS(INDEX(AW:AW,11):INDEX(AW:AW,100000),INDEX($F:$F,11):INDEX($F:$F,100000),$P1,INDEX($J:$J,11):INDEX($J:$J,100000),\"3_Prototype\")\n+SUMIFS(INDEX(AW:AW,11):INDEX(AW:AW,100000),INDEX($F:$F,11):INDEX($F:$F,100000),$P1,INDEX($J:$J,11):INDEX($J:$J,100000),\"4_Testing\")","v":0},{"$f":"SUMIFS(INDEX(AX:AX,11):INDEX(AX:AX,100000),INDEX($F:$F,11):INDEX($F:$F,100000),$P1,INDEX($J:$J,11):INDEX($J:$J,100000),\"0_AttentionNeeded\")\n+SUMIFS(INDEX(AX:AX,11):INDEX(AX:AX,100000),INDEX($F:$F,11):INDEX($F:$F,100000),$P1,INDEX($J:$J,11):INDEX($J:$J,100000),\"1_Assigned\")\n+SUMIFS(INDEX(AX:AX,11):INDEX(AX:AX,100000),INDEX($F:$F,11):INDEX($F:$F,100000),$P1,INDEX($J:$J,11):INDEX($J:$J,100000),\"2_InProgress\")\n+SUMIFS(INDEX(AX:AX,11):INDEX(AX:AX,100000),INDEX($F:$F,11):INDEX($F:$F,100000),$P1,INDEX($J:$J,11):INDEX($J:$J,100000),\"3_Prototype\")\n+SUMIFS(INDEX(AX:AX,11):INDEX(AX:AX,100000),INDEX($F:$F,11):INDEX($F:$F,100000),$P1,INDEX($J:$J,11):INDEX($J:$J,100000),\"4_Testing\")","v":0},{"$f":"SUMIFS(INDEX(AY:AY,11):INDEX(AY:AY,100000),INDEX($F:$F,11):INDEX($F:$F,100000),$P1,INDEX($J:$J,11):INDEX($J:$J,100000),\"0_AttentionNeeded\")\n+SUMIFS(INDEX(AY:AY,11):INDEX(AY:AY,100000),INDEX($F:$F,11):INDEX($F:$F,100000),$P1,INDEX($J:$J,11):INDEX($J:$J,100000),\"1_Assigned\")\n+SUMIFS(INDEX(AY:AY,11):INDEX(AY:AY,100000),INDEX($F:$F,11):INDEX($F:$F,100000),$P1,INDEX($J:$J,11):INDEX($J:$J,100000),\"2_InProgress\")\n+SUMIFS(INDEX(AY:AY,11):INDEX(AY:AY,100000),INDEX($F:$F,11):INDEX($F:$F,100000),$P1,INDEX($J:$J,11):INDEX($J:$J,100000),\"3_Prototype\")\n+SUMIFS(INDEX(AY:AY,11):INDEX(AY:AY,100000),INDEX($F:$F,11):INDEX($F:$F,100000),$P1,INDEX($J:$J,11):INDEX($J:$J,100000),\"4_Testing\")","v":0},{"$f":"SUM(BA1:BF1)","v":0},{"$f":"SUMIFS(INDEX(BA:BA,11):INDEX(BA:BA,100000),INDEX($F:$F,11):INDEX($F:$F,100000),$P1,INDEX($J:$J,11):INDEX($J:$J,100000),\"0_AttentionNeeded\")\n+SUMIFS(INDEX(BA:BA,11):INDEX(BA:BA,100000),INDEX($F:$F,11):INDEX($F:$F,100000),$P1,INDEX($J:$J,11):INDEX($J:$J,100000),\"1_Assigned\")\n+SUMIFS(INDEX(BA:BA,11):INDEX(BA:BA,100000),INDEX($F:$F,11):INDEX($F:$F,100000),$P1,INDEX($J:$J,11):INDEX($J:$J,100000),\"2_InProgress\")\n+SUMIFS(INDEX(BA:BA,11):INDEX(BA:BA,100000),INDEX($F:$F,11):INDEX($F:$F,100000),$P1,INDEX($J:$J,11):INDEX($J:$J,100000),\"3_Prototype\")\n+SUMIFS(INDEX(BA:BA,11):INDEX(BA:BA,100000),INDEX($F:$F,11):INDEX($F:$F,100000),$P1,INDEX($J:$J,11):INDEX($J:$J,100000),\"4_Testing\")","v":0},{"$f":"SUMIFS(INDEX(BB:BB,11):INDEX(BB:BB,100000),INDEX($F:$F,11):INDEX($F:$F,100000),$P1,INDEX($J:$J,11):INDEX($J:$J,100000),\"0_AttentionNeeded\")\n+SUMIFS(INDEX(BB:BB,11):INDEX(BB:BB,100000),INDEX($F:$F,11):INDEX($F:$F,100000),$P1,INDEX($J:$J,11):INDEX($J:$J,100000),\"1_Assigned\")\n+SUMIFS(INDEX(BB:BB,11):INDEX(BB:BB,100000),INDEX($F:$F,11):INDEX($F:$F,100000),$P1,INDEX($J:$J,11):INDEX($J:$J,100000),\"2_InProgress\")\n+SUMIFS(INDEX(BB:BB,11):INDEX(BB:BB,100000),INDEX($F:$F,11):INDEX($F:$F,100000),$P1,INDEX($J:$J,11):INDEX($J:$J,100000),\"3_Prototype\")\n+SUMIFS(INDEX(BB:BB,11):INDEX(BB:BB,100000),INDEX($F:$F,11):INDEX($F:$F,100000),$P1,INDEX($J:$J,11):INDEX($J:$J,100000),\"4_Testing\")","v":0},{"$f":"SUMIFS(INDEX(BC:BC,11):INDEX(BC:BC,100000),INDEX($F:$F,11):INDEX($F:$F,100000),$P1,INDEX($J:$J,11):INDEX($J:$J,100000),\"0_AttentionNeeded\")\n+SUMIFS(INDEX(BC:BC,11):INDEX(BC:BC,100000),INDEX($F:$F,11):INDEX($F:$F,100000),$P1,INDEX($J:$J,11):INDEX($J:$J,100000),\"1_Assigned\")\n+SUMIFS(INDEX(BC:BC,11):INDEX(BC:BC,100000),INDEX($F:$F,11):INDEX($F:$F,100000),$P1,INDEX($J:$J,11):INDEX($J:$J,100000),\"2_InProgress\")\n+SUMIFS(INDEX(BC:BC,11):INDEX(BC:BC,100000),INDEX($F:$F,11):INDEX($F:$F,100000),$P1,INDEX($J:$J,11):INDEX($J:$J,100000),\"3_Prototype\")\n+SUMIFS(INDEX(BC:BC,11):INDEX(BC:BC,100000),INDEX($F:$F,11):INDEX($F:$F,100000),$P1,INDEX($J:$J,11):INDEX($J:$J,100000),\"4_Testing\")","v":0},{"$f":"SUMIFS(INDEX(BD:BD,11):INDEX(BD:BD,100000),INDEX($F:$F,11):INDEX($F:$F,100000),$P1,INDEX($J:$J,11):INDEX($J:$J,100000),\"0_AttentionNeeded\")\n+SUMIFS(INDEX(BD:BD,11):INDEX(BD:BD,100000),INDEX($F:$F,11):INDEX($F:$F,100000),$P1,INDEX($J:$J,11):INDEX($J:$J,100000),\"1_Assigned\")\n+SUMIFS(INDEX(BD:BD,11):INDEX(BD:BD,100000),INDEX($F:$F,11):INDEX($F:$F,100000),$P1,INDEX($J:$J,11):INDEX($J:$J,100000),\"2_InProgress\")\n+SUMIFS(INDEX(BD:BD,11):INDEX(BD:BD,100000),INDEX($F:$F,11):INDEX($F:$F,100000),$P1,INDEX($J:$J,11):INDEX($J:$J,100000),\"3_Prototype\")\n+SUMIFS(INDEX(BD:BD,11):INDEX(BD:BD,100000),INDEX($F:$F,11):INDEX($F:$F,100000),$P1,INDEX($J:$J,11):INDEX($J:$J,100000),\"4_Testing\")","v":0},{"$f":"SUMIFS(INDEX(BE:BE,11):INDEX(BE:BE,100000),INDEX($F:$F,11):INDEX($F:$F,100000),$P1,INDEX($J:$J,11):INDEX($J:$J,100000),\"0_AttentionNeeded\")\n+SUMIFS(INDEX(BE:BE,11):INDEX(BE:BE,100000),INDEX($F:$F,11):INDEX($F:$F,100000),$P1,INDEX($J:$J,11):INDEX($J:$J,100000),\"1_Assigned\")\n+SUMIFS(INDEX(BE:BE,11):INDEX(BE:BE,100000),INDEX($F:$F,11):INDEX($F:$F,100000),$P1,INDEX($J:$J,11):INDEX($J:$J,100000),\"2_InProgress\")\n+SUMIFS(INDEX(BE:BE,11):INDEX(BE:BE,100000),INDEX($F:$F,11):INDEX($F:$F,100000),$P1,INDEX($J:$J,11):INDEX($J:$J,100000),\"3_Prototype\")\n+SUMIFS(INDEX(BE:BE,11):INDEX(BE:BE,100000),INDEX($F:$F,11):INDEX($F:$F,100000),$P1,INDEX($J:$J,11):INDEX($J:$J,100000),\"4_Testing\")","v":0},{"$f":"SUMIFS(INDEX(BF:BF,11):INDEX(BF:BF,100000),INDEX($F:$F,11):INDEX($F:$F,100000),$P1,INDEX($J:$J,11):INDEX($J:$J,100000),\"0_AttentionNeeded\")\n+SUMIFS(INDEX(BF:BF,11):INDEX(BF:BF,100000),INDEX($F:$F,11):INDEX($F:$F,100000),$P1,INDEX($J:$J,11):INDEX($J:$J,100000),\"1_Assigned\")\n+SUMIFS(INDEX(BF:BF,11):INDEX(BF:BF,100000),INDEX($F:$F,11):INDEX($F:$F,100000),$P1,INDEX($J:$J,11):INDEX($J:$J,100000),\"2_InProgress\")\n+SUMIFS(INDEX(BF:BF,11):INDEX(BF:BF,100000),INDEX($F:$F,11):INDEX($F:$F,100000),$P1,INDEX($J:$J,11):INDEX($J:$J,100000),\"3_Prototype\")\n+SUMIFS(INDEX(BF:BF,11):INDEX(BF:BF,100000),INDEX($F:$F,11):INDEX($F:$F,100000),$P1,INDEX($J:$J,11):INDEX($J:$J,100000),\"4_Testing\")","v":0}]
["ScheduleSheet",null,null,null,null,null,null,null,null,null,null,null,null,null,null,"GA",{"$f":"SUM(R2:W2)","v":0},{"$f":"SUMIFS(INDEX(R:R,11):INDEX(R:R,100000),INDEX($F:$F,11):INDEX($F:$F,100000),$P2,INDEX($J:$J,11):INDEX($J:$J,100000),\"0_AttentionNeeded\")\n+SUMIFS(INDEX(R:R,11):INDEX(R:R,100000),INDEX($F:$F,11):INDEX($F:$F,100000),$P2,INDEX($J:$J,11):INDEX($J:$J,100000),\"1_Assigned\")\n+SUMIFS(INDEX(R:R,11):INDEX(R:R,100000),INDEX($F:$F,11):INDEX($F:$F,100000),$P2,INDEX($J:$J,11):INDEX($J:$J,100000),\"2_InProgress\")\n+SUMIFS(INDEX(R:R,11):INDEX(R:R,100000),INDEX($F:$F,11):INDEX($F:$F,100000),$P2,INDEX($J:$J,11):INDEX($J:$J,100000),\"3_Prototype\")\n+SUMIFS(INDEX(R:R,11):INDEX(R:R,100000),INDEX($F:$F,11):INDEX($F:$F,100000),$P2,INDEX($J:$J,11):INDEX($J:$J,100000),\"4_Testing\")","v":0},{"$f":"SUMIFS(INDEX(S:S,11):INDEX(S:S,100000),INDEX($F:$F,11):INDEX($F:$F,100000),$P2,INDEX($J:$J,11):INDEX($J:$J,100000),\"0_AttentionNeeded\")\n+SUMIFS(INDEX(S:S,11):INDEX(S:S,100000),INDEX($F:$F,11):INDEX($F:$F,100000),$P2,INDEX($J:$J,11):INDEX($J:$J,100000),\"1_Assigned\")\n+SUMIFS(INDEX(S:S,11):INDEX(S:S,100000),INDEX($F:$F,11):INDEX($F:$F,100000),$P2,INDEX($J:$J,11):INDEX($J:$J,100000),\"2_InProgress\")\n+SUMIFS(INDEX(S:S,11):INDEX(S:S,100000),INDEX($F:$F,11):INDEX($F:$F,100000),$P2,INDEX($J:$J,11):INDEX($J:$J,100000),\"3_Prototype\")\n+SUMIFS(INDEX(S:S,11):INDEX(S:S,100000),INDEX($F:$F,11):INDEX($F:$F,100000),$P2,INDEX($J:$J,11):INDEX($J:$J,100000),\"4_Testing\")","v":0},{"$f":"SUMIFS(INDEX(T:T,11):INDEX(T:T,100000),INDEX($F:$F,11):INDEX($F:$F,100000),$P2,INDEX($J:$J,11):INDEX($J:$J,100000),\"0_AttentionNeeded\")\n+SUMIFS(INDEX(T:T,11):INDEX(T:T,100000),INDEX($F:$F,11):INDEX($F:$F,100000),$P2,INDEX($J:$J,11):INDEX($J:$J,100000),\"1_Assigned\")\n+SUMIFS(INDEX(T:T,11):INDEX(T:T,100000),INDEX($F:$F,11):INDEX($F:$F,100000),$P2,INDEX($J:$J,11):INDEX($J:$J,100000),\"2_InProgress\")\n+SUMIFS(INDEX(T:T,11):INDEX(T:T,100000),INDEX($F:$F,11):INDEX($F:$F,100000),$P2,INDEX($J:$J,11):INDEX($J:$J,100000),\"3_Prototype\")\n+SUMIFS(INDEX(T:T,11):INDEX(T:T,100000),INDEX($F:$F,11):INDEX($F:$F,100000),$P2,INDEX($J:$J,11):INDEX($J:$J,100000),\"4_Testing\")","v":0},{"$f":"SUMIFS(INDEX(U:U,11):INDEX(U:U,100000),INDEX($F:$F,11):INDEX($F:$F,100000),$P2,INDEX($J:$J,11):INDEX($J:$J,100000),\"0_AttentionNeeded\")\n+SUMIFS(INDEX(U:U,11):INDEX(U:U,100000),INDEX($F:$F,11):INDEX($F:$F,100000),$P2,INDEX($J:$J,11):INDEX($J:$J,100000),\"1_Assigned\")\n+SUMIFS(INDEX(U:U,11):INDEX(U:U,100000),INDEX($F:$F,11):INDEX($F:$F,100000),$P2,INDEX($J:$J,11):INDEX($J:$J,100000),\"2_InProgress\")\n+SUMIFS(INDEX(U:U,11):INDEX(U:U,100000),INDEX($F:$F,11):INDEX($F:$F,100000),$P2,INDEX($J:$J,11):INDEX($J:$J,100000),\"3_Prototype\")\n+SUMIFS(INDEX(U:U,11):INDEX(U:U,100000),INDEX($F:$F,11):INDEX($F:$F,100000),$P2,INDEX($J:$J,11):INDEX($J:$J,100000),\"4_Testing\")","v":0},{"$f":"SUMIFS(INDEX(V:V,11):INDEX(V:V,100000),INDEX($F:$F,11):INDEX($F:$F,100000),$P2,INDEX($J:$J,11):INDEX($J:$J,100000),\"0_AttentionNeeded\")\n+SUMIFS(INDEX(V:V,11):INDEX(V:V,100000),INDEX($F:$F,11):INDEX($F:$F,100000),$P2,INDEX($J:$J,11):INDEX($J:$J,100000),\"1_Assigned\")\n+SUMIFS(INDEX(V:V,11):INDEX(V:V,100000),INDEX($F:$F,11):INDEX($F:$F,100000),$P2,INDEX($J:$J,11):INDEX($J:$J,100000),\"2_InProgress\")\n+SUMIFS(INDEX(V:V,11):INDEX(V:V,100000),INDEX($F:$F,11):INDEX($F:$F,100000),$P2,INDEX($J:$J,11):INDEX($J:$J,100000),\"3_Prototype\")\n+SUMIFS(INDEX(V:V,11):INDEX(V:V,100000),INDEX($F:$F,11):INDEX($F:$F,100000),$P2,INDEX($J:$J,11):INDEX($J:$J,100000),\"4_Testing\")","v":0},{"$f":"SUMIFS(INDEX(W:W,11):INDEX(W:W,100000),INDEX($F:$F,11):INDEX($F:$F,100000),$P2,INDEX($J:$J,11):INDEX($J:$J,100000),\"0_AttentionNeeded\")\n+SUMIFS(INDEX(W:W,11):INDEX(W:W,100000),INDEX($F:$F,11):INDEX($F:$F,100000),$P2,INDEX($J:$J,11):INDEX($J:$J,100000),\"1_Assigned\")\n+SUMIFS(INDEX(W:W,11):INDEX(W:W,100000),INDEX($F:$F,11):INDEX($F:$F,100000),$P2,INDEX($J:$J,11):INDEX($J:$J,100000),\"2_InProgress\")\n+SUMIFS(INDEX(W:W,11):INDEX(W:W,100000),INDEX($F:$F,11):INDEX($F:$F,100000),$P2,INDEX($J:$J,11):INDEX($J:$J,100000),\"3_Prototype\")\n+SUMIFS(INDEX(W:W,11):INDEX(W:W,100000),INDEX($F:$F,11):INDEX($F:$F,100000),$P2,INDEX($J:$J,11):INDEX($J:$J,100000),\"4_Testing\")","v":0},{"$f":"SUM(Y2:AD2)","v":0},{"$f":"SUMIFS(INDEX(Y:Y,11):INDEX(Y:Y,100000),INDEX($F:$F,11):INDEX($F:$F,100000),$P2,INDEX($J:$J,11):INDEX($J:$J,100000),\"0_AttentionNeeded\")\n+SUMIFS(INDEX(Y:Y,11):INDEX(Y:Y,100000),INDEX($F:$F,11):INDEX($F:$F,100000),$P2,INDEX($J:$J,11):INDEX($J:$J,100000),\"1_Assigned\")\n+SUMIFS(INDEX(Y:Y,11):INDEX(Y:Y,100000),INDEX($F:$F,11):INDEX($F:$F,100000),$P2,INDEX($J:$J,11):INDEX($J:$J,100000),\"2_InProgress\")\n+SUMIFS(INDEX(Y:Y,11):INDEX(Y:Y,100000),INDEX($F:$F,11):INDEX($F:$F,100000),$P2,INDEX($J:$J,11):INDEX($J:$J,100000),\"3_Prototype\")\n+SUMIFS(INDEX(Y:Y,11):INDEX(Y:Y,100000),INDEX($F:$F,11):INDEX($F:$F,100000),$P2,INDEX($J:$J,11):INDEX($J:$J,100000),\"4_Testing\")","v":0},{"$f":"SUMIFS(INDEX(Z:Z,11):INDEX(Z:Z,100000),INDEX($F:$F,11):INDEX($F:$F,100000),$P2,INDEX($J:$J,11):INDEX($J:$J,100000),\"0_AttentionNeeded\")\n+SUMIFS(INDEX(Z:Z,11):INDEX(Z:Z,100000),INDEX($F:$F,11):INDEX($F:$F,100000),$P2,INDEX($J:$J,11):INDEX($J:$J,100000),\"1_Assigned\")\n+SUMIFS(INDEX(Z:Z,11):INDEX(Z:Z,100000),INDEX($F:$F,11):INDEX($F:$F,100000),$P2,INDEX($J:$J,11):INDEX($J:$J,100000),\"2_InProgress\")\n+SUMIFS(INDEX(Z:Z,11):INDEX(Z:Z,100000),INDEX($F:$F,11):INDEX($F:$F,100000),$P2,INDEX($J:$J,11):INDEX($J:$J,100000),\"3_Prototype\")\n+SUMIFS(INDEX(Z:Z,11):INDEX(Z:Z,100000),INDEX($F:$F,11):INDEX($F:$F,100000),$P2,INDEX($J:$J,11):INDEX($J:$J,100000),\"4_Testing\")","v":0},{"$f":"SUMIFS(INDEX(AA:AA,11):INDEX(AA:AA,100000),INDEX($F:$F,11):INDEX($F:$F,100000),$P2,INDEX($J:$J,11):INDEX($J:$J,100000),\"0_AttentionNeeded\")\n+SUMIFS(INDEX(AA:AA,11):INDEX(AA:AA,100000),INDEX($F:$F,11):INDEX($F:$F,100000),$P2,INDEX($J:$J,11):INDEX($J:$J,100000),\"1_Assigned\")\n+SUMIFS(INDEX(AA:AA,11):INDEX(AA:AA,100000),INDEX($F:$F,11):INDEX($F:$F,100000),$P2,INDEX($J:$J,11):INDEX($J:$J,100000),\"2_InProgress\")\n+SUMIFS(INDEX(AA:AA,11):INDEX(AA:AA,100000),INDEX($F:$F,11):INDEX($F:$F,100000),$P2,INDEX($J:$J,11):INDEX($J:$J,100000),\"3_Prototype\")\n+SUMIFS(INDEX(AA:AA,11):INDEX(AA:AA,100000),INDEX($F:$F,11):INDEX($F:$F,100000),$P2,INDEX($J:$J,11):INDEX($J:$J,100000),\"4_Testing\")","v":0},{"$f":"SUMIFS(INDEX(AB:AB,11):INDEX(AB:AB,100000),INDEX($F:$F,11):INDEX($F:$F,100000),$P2,INDEX($J:$J,11):INDEX($J:$J,100000),\"0_AttentionNeeded\")\n+SUMIFS(INDEX(AB:AB,11):INDEX(AB:AB,100000),INDEX($F:$F,11):INDEX($F:$F,100000),$P2,INDEX($J:$J,11):INDEX($J:$J,100000),\"1_Assigned\")\n+SUMIFS(INDEX(AB:AB,11):INDEX(AB:AB,100000),INDEX($F:$F,11):INDEX($F:$F,100000),$P2,INDEX($J:$J,11):INDEX($J:$J,100000),\"2_InProgress\")\n+SUMIFS(INDEX(AB:AB,11):INDEX(AB:AB,100000),INDEX($F:$F,11):INDEX($F:$F,100000),$P2,INDEX($J:$J,11):INDEX($J:$J,100000),\"3_Prototype\")\n+SUMIFS(INDEX(AB:AB,11):INDEX(AB:AB,100000),INDEX($F:$F,11):INDEX($F:$F,100000),$P2,INDEX($J:$J,11):INDEX($J:$J,100000),\"4_Testing\")","v":0},{"$f":"SUMIFS(INDEX(AC:AC,11):INDEX(AC:AC,100000),INDEX($F:$F,11):INDEX($F:$F,100000),$P2,INDEX($J:$J,11):INDEX($J:$J,100000),\"0_AttentionNeeded\")\n+SUMIFS(INDEX(AC:AC,11):INDEX(AC:AC,100000),INDEX($F:$F,11):INDEX($F:$F,100000),$P2,INDEX($J:$J,11):INDEX($J:$J,100000),\"1_Assigned\")\n+SUMIFS(INDEX(AC:AC,11):INDEX(AC:AC,100000),INDEX($F:$F,11):INDEX($F:$F,100000),$P2,INDEX($J:$J,11):INDEX($J:$J,100000),\"2_InProgress\")\n+SUMIFS(INDEX(AC:AC,11):INDEX(AC:AC,100000),INDEX($F:$F,11):INDEX($F:$F,100000),$P2,INDEX($J:$J,11):INDEX($J:$J,100000),\"3_Prototype\")\n+SUMIFS(INDEX(AC:AC,11):INDEX(AC:AC,100000),INDEX($F:$F,11):INDEX($F:$F,100000),$P2,INDEX($J:$J,11):INDEX($J:$J,100000),\"4_Testing\")","v":0},{"$f":"SUMIFS(INDEX(AD:AD,11):INDEX(AD:AD,100000),INDEX($F:$F,11):INDEX($F:$F,100000),$P2,INDEX($J:$J,11):INDEX($J:$J,100000),\"0_AttentionNeeded\")\n+SUMIFS(INDEX(AD:AD,11):INDEX(AD:AD,100000),INDEX($F:$F,11):INDEX($F:$F,100000),$P2,INDEX($J:$J,11):INDEX($J:$J,100000),\"1_Assigned\")\n+SUMIFS(INDEX(AD:AD,11):INDEX(AD:AD,100000),INDEX($F:$F,11):INDEX($F:$F,100000),$P2,INDEX($J:$J,11):INDEX($J:$J,100000),\"2_InProgress\")\n+SUMIFS(INDEX(AD:AD,11):INDEX(AD:AD,100000),INDEX($F:$F,11):INDEX($F:$F,100000),$P2,INDEX($J:$J,11):INDEX($J:$J,100000),\"3_Prototype\")\n+SUMIFS(INDEX(AD:AD,11):INDEX(AD:AD,100000),INDEX($F:$F,11):INDEX($F:$F,100000),$P2,INDEX($J:$J,11):INDEX($J:$J,100000),\"4_Testing\")","v":0},{"$f":"SUM(AF2:AK2)","v":0},{"$f":"SUMIFS(INDEX(AF:AF,11):INDEX(AF:AF,100000),INDEX($F:$F,11):INDEX($F:$F,100000),$P2,INDEX($J:$J,11):INDEX($J:$J,100000),\"0_AttentionNeeded\")\n+SUMIFS(INDEX(AF:AF,11):INDEX(AF:AF,100000),INDEX($F:$F,11):INDEX($F:$F,100000),$P2,INDEX($J:$J,11):INDEX($J:$J,100000),\"1_Assigned\")\n+SUMIFS(INDEX(AF:AF,11):INDEX(AF:AF,100000),INDEX($F:$F,11):INDEX($F:$F,100000),$P2,INDEX($J:$J,11):INDEX($J:$J,100000),\"2_InProgress\")\n+SUMIFS(INDEX(AF:AF,11):INDEX(AF:AF,100000),INDEX($F:$F,11):INDEX($F:$F,100000),$P2,INDEX($J:$J,11):INDEX($J:$J,100000),\"3_Prototype\")\n+SUMIFS(INDEX(AF:AF,11):INDEX(AF:AF,100000),INDEX($F:$F,11):INDEX($F:$F,100000),$P2,INDEX($J:$J,11):INDEX($J:$J,100000),\"4_Testing\")","v":0},{"$f":"SUMIFS(INDEX(AG:AG,11):INDEX(AG:AG,100000),INDEX($F:$F,11):INDEX($F:$F,100000),$P2,INDEX($J:$J,11):INDEX($J:$J,100000),\"0_AttentionNeeded\")\n+SUMIFS(INDEX(AG:AG,11):INDEX(AG:AG,100000),INDEX($F:$F,11):INDEX($F:$F,100000),$P2,INDEX($J:$J,11):INDEX($J:$J,100000),\"1_Assigned\")\n+SUMIFS(INDEX(AG:AG,11):INDEX(AG:AG,100000),INDEX($F:$F,11):INDEX($F:$F,100000),$P2,INDEX($J:$J,11):INDEX($J:$J,100000),\"2_InProgress\")\n+SUMIFS(INDEX(AG:AG,11):INDEX(AG:AG,100000),INDEX($F:$F,11):INDEX($F:$F,100000),$P2,INDEX($J:$J,11):INDEX($J:$J,100000),\"3_Prototype\")\n+SUMIFS(INDEX(AG:AG,11):INDEX(AG:AG,100000),INDEX($F:$F,11):INDEX($F:$F,100000),$P2,INDEX($J:$J,11):INDEX($J:$J,100000),\"4_Testing\")","v":0},{"$f":"SUMIFS(INDEX(AH:AH,11):INDEX(AH:AH,100000),INDEX($F:$F,11):INDEX($F:$F,100000),$P2,INDEX($J:$J,11):INDEX($J:$J,100000),\"0_AttentionNeeded\")\n+SUMIFS(INDEX(AH:AH,11):INDEX(AH:AH,100000),INDEX($F:$F,11):INDEX($F:$F,100000),$P2,INDEX($J:$J,11):INDEX($J:$J,100000),\"1_Assigned\")\n+SUMIFS(INDEX(AH:AH,11):INDEX(AH:AH,100000),INDEX($F:$F,11):INDEX($F:$F,100000),$P2,INDEX($J:$J,11):INDEX($J:$J,100000),\"2_InProgress\")\n+SUMIFS(INDEX(AH:AH,11):INDEX(AH:AH,100000),INDEX($F:$F,11):INDEX($F:$F,100000),$P2,INDEX($J:$J,11):INDEX($J:$J,100000),\"3_Prototype\")\n+SUMIFS(INDEX(AH:AH,11):INDEX(AH:AH,100000),INDEX($F:$F,11):INDEX($F:$F,100000),$P2,INDEX($J:$J,11):INDEX($J:$J,100000),\"4_Testing\")","v":0},{"$f":"SUMIFS(INDEX(AI:AI,11):INDEX(AI:AI,100000),INDEX($F:$F,11):INDEX($F:$F,100000),$P2,INDEX($J:$J,11):INDEX($J:$J,100000),\"0_AttentionNeeded\")\n+SUMIFS(INDEX(AI:AI,11):INDEX(AI:AI,100000),INDEX($F:$F,11):INDEX($F:$F,100000),$P2,INDEX($J:$J,11):INDEX($J:$J,100000),\"1_Assigned\")\n+SUMIFS(INDEX(AI:AI,11):INDEX(AI:AI,100000),INDEX($F:$F,11):INDEX($F:$F,100000),$P2,INDEX($J:$J,11):INDEX($J:$J,100000),\"2_InProgress\")\n+SUMIFS(INDEX(AI:AI,11):INDEX(AI:AI,100000),INDEX($F:$F,11):INDEX($F:$F,100000),$P2,INDEX($J:$J,11):INDEX($J:$J,100000),\"3_Prototype\")\n+SUMIFS(INDEX(AI:AI,11):INDEX(AI:AI,100000),INDEX($F:$F,11):INDEX($F:$F,100000),$P2,INDEX($J:$J,11):INDEX($J:$J,100000),\"4_Testing\")","v":0},{"$f":"SUMIFS(INDEX(AJ:AJ,11):INDEX(AJ:AJ,100000),INDEX($F:$F,11):INDEX($F:$F,100000),$P2,INDEX($J:$J,11):INDEX($J:$J,100000),\"0_AttentionNeeded\")\n+SUMIFS(INDEX(AJ:AJ,11):INDEX(AJ:AJ,100000),INDEX($F:$F,11):INDEX($F:$F,100000),$P2,INDEX($J:$J,11):INDEX($J:$J,100000),\"1_Assigned\")\n+SUMIFS(INDEX(AJ:AJ,11):INDEX(AJ:AJ,100000),INDEX($F:$F,11):INDEX($F:$F,100000),$P2,INDEX($J:$J,11):INDEX($J:$J,100000),\"2_InProgress\")\n+SUMIFS(INDEX(AJ:AJ,11):INDEX(AJ:AJ,100000),INDEX($F:$F,11):INDEX($F:$F,100000),$P2,INDEX($J:$J,11):INDEX($J:$J,100000),\"3_Prototype\")\n+SUMIFS(INDEX(AJ:AJ,11):INDEX(AJ:AJ,100000),INDEX($F:$F,11):INDEX($F:$F,100000),$P2,INDEX($J:$J,11):INDEX($J:$J,100000),\"4_Testing\")","v":0},{"$f":"SUMIFS(INDEX(AK:AK,11):INDEX(AK:AK,100000),INDEX($F:$F,11):INDEX($F:$F,100000),$P2,INDEX($J:$J,11):INDEX($J:$J,100000),\"0_AttentionNeeded\")\n+SUMIFS(INDEX(AK:AK,11):INDEX(AK:AK,100000),INDEX($F:$F,11):INDEX($F:$F,100000),$P2,INDEX($J:$J,11):INDEX($J:$J,100000),\"1_Assigned\")\n+SUMIFS(INDEX(AK:AK,11):INDEX(AK:AK,100000),INDEX($F:$F,11):INDEX($F:$F,100000),$P2,INDEX($J:$J,11):INDEX($J:$J,100000),\"2_InProgress\")\n+SUMIFS(INDEX(AK:AK,11):INDEX(AK:AK,100000),INDEX($F:$F,11):INDEX($F:$F,100000),$P2,INDEX($J:$J,11):INDEX($J:$J,100000),\"3_Prototype\")\n+SUMIFS(INDEX(AK:AK,11):INDEX(AK:AK,100000),INDEX($F:$F,11):INDEX($F:$F,100000),$P2,INDEX($J:$J,11):INDEX($J:$J,100000),\"4_Testing\")","v":0},{"$f":"SUM(AM2:AR2)","v":0},{"$f":"SUMIFS(INDEX(AM:AM,11):INDEX(AM:AM,100000),INDEX($F:$F,11):INDEX($F:$F,100000),$P2,INDEX($J:$J,11):INDEX($J:$J,100000),\"0_AttentionNeeded\")\n+SUMIFS(INDEX(AM:AM,11):INDEX(AM:AM,100000),INDEX($F:$F,11):INDEX($F:$F,100000),$P2,INDEX($J:$J,11):INDEX($J:$J,100000),\"1_Assigned\")\n+SUMIFS(INDEX(AM:AM,11):INDEX(AM:AM,100000),INDEX($F:$F,11):INDEX($F:$F,100000),$P2,INDEX($J:$J,11):INDEX($J:$J,100000),\"2_InProgress\")\n+SUMIFS(INDEX(AM:AM,11):INDEX(AM:AM,100000),INDEX($F:$F,11):INDEX($F:$F,100000),$P2,INDEX($J:$J,11):INDEX($J:$J,100000),\"3_Prototype\")\n+SUMIFS(INDEX(AM:AM,11):INDEX(AM:AM,100000),INDEX($F:$F,11):INDEX($F:$F,100000),$P2,INDEX($J:$J,11):INDEX($J:$J,100000),\"4_Testing\")","v":0},{"$f":"SUMIFS(INDEX(AN:AN,11):INDEX(AN:AN,100000),INDEX($F:$F,11):INDEX($F:$F,100000),$P2,INDEX($J:$J,11):INDEX($J:$J,100000),\"0_AttentionNeeded\")\n+SUMIFS(INDEX(AN:AN,11):INDEX(AN:AN,100000),INDEX($F:$F,11):INDEX($F:$F,100000),$P2,INDEX($J:$J,11):INDEX($J:$J,100000),\"1_Assigned\")\n+SUMIFS(INDEX(AN:AN,11):INDEX(AN:AN,100000),INDEX($F:$F,11):INDEX($F:$F,100000),$P2,INDEX($J:$J,11):INDEX($J:$J,100000),\"2_InProgress\")\n+SUMIFS(INDEX(AN:AN,11):INDEX(AN:AN,100000),INDEX($F:$F,11):INDEX($F:$F,100000),$P2,INDEX($J:$J,11):INDEX($J:$J,100000),\"3_Prototype\")\n+SUMIFS(INDEX(AN:AN,11):INDEX(AN:AN,100000),INDEX($F:$F,11):INDEX($F:$F,100000),$P2,INDEX($J:$J,11):INDEX($J:$J,100000),\"4_Testing\")","v":0},{"$f":"SUMIFS(INDEX(AO:AO,11):INDEX(AO:AO,100000),INDEX($F:$F,11):INDEX($F:$F,100000),$P2,INDEX($J:$J,11):INDEX($J:$J,100000),\"0_AttentionNeeded\")\n+SUMIFS(INDEX(AO:AO,11):INDEX(AO:AO,100000),INDEX($F:$F,11):INDEX($F:$F,100000),$P2,INDEX($J:$J,11):INDEX($J:$J,100000),\"1_Assigned\")\n+SUMIFS(INDEX(AO:AO,11):INDEX(AO:AO,100000),INDEX($F:$F,11):INDEX($F:$F,100000),$P2,INDEX($J:$J,11):INDEX($J:$J,100000),\"2_InProgress\")\n+SUMIFS(INDEX(AO:AO,11):INDEX(AO:AO,100000),INDEX($F:$F,11):INDEX($F:$F,100000),$P2,INDEX($J:$J,11):INDEX($J:$J,100000),\"3_Prototype\")\n+SUMIFS(INDEX(AO:AO,11):INDEX(AO:AO,100000),INDEX($F:$F,11):INDEX($F:$F,100000),$P2,INDEX($J:$J,11):INDEX($J:$J,100000),\"4_Testing\")","v":0},{"$f":"SUMIFS(INDEX(AP:AP,11):INDEX(AP:AP,100000),INDEX($F:$F,11):INDEX($F:$F,100000),$P2,INDEX($J:$J,11):INDEX($J:$J,100000),\"0_AttentionNeeded\")\n+SUMIFS(INDEX(AP:AP,11):INDEX(AP:AP,100000),INDEX($F:$F,11):INDEX($F:$F,100000),$P2,INDEX($J:$J,11):INDEX($J:$J,100000),\"1_Assigned\")\n+SUMIFS(INDEX(AP:AP,11):INDEX(AP:AP,100000),INDEX($F:$F,11):INDEX($F:$F,100000),$P2,INDEX($J:$J,11):INDEX($J:$J,100000),\"2_InProgress\")\n+SUMIFS(INDEX(AP:AP,11):INDEX(AP:AP,100000),INDEX($F:$F,11):INDEX($F:$F,100000),$P2,INDEX($J:$J,11):INDEX($J:$J,100000),\"3_Prototype\")\n+SUMIFS(INDEX(AP:AP,11):INDEX(AP:AP,100000),INDEX($F:$F,11):INDEX($F:$F,100000),$P2,INDEX($J:$J,11):INDEX($J:$J,100000),\"4_Testing\")","v":0},{"$f":"SUMIFS(INDEX(AQ:AQ,11):INDEX(AQ:AQ,100000),INDEX($F:$F,11):INDEX($F:$F,100000),$P2,INDEX($J:$J,11):INDEX($J:$J,100000),\"0_AttentionNeeded\")\n+SUMIFS(INDEX(AQ:AQ,11):INDEX(AQ:AQ,100000),INDEX($F:$F,11):INDEX($F:$F,100000),$P2,INDEX($J:$J,11):INDEX($J:$J,100000),\"1_Assigned\")\n+SUMIFS(INDEX(AQ:AQ,11):INDEX(AQ:AQ,100000),INDEX($F:$F,11):INDEX($F:$F,100000),$P2,INDEX($J:$J,11):INDEX($J:$J,100000),\"2_InProgress\")\n+SUMIFS(INDEX(AQ:AQ,11):INDEX(AQ:AQ,100000),INDEX($F:$F,11):INDEX($F:$F,100000),$P2,INDEX($J:$J,11):INDEX($J:$J,100000),\"3_Prototype\")\n+SUMIFS(INDEX(AQ:AQ,11):INDEX(AQ:AQ,100000),INDEX($F:$F,11):INDEX($F:$F,100000),$P2,INDEX($J:$J,11):INDEX($J:$J,100000),\"4_Testing\")","v":0},{"$f":"SUMIFS(INDEX(AR:AR,11):INDEX(AR:AR,100000),INDEX($F:$F,11):INDEX($F:$F,100000),$P2,INDEX($J:$J,11):INDEX($J:$J,100000),\"0_AttentionNeeded\")\n+SUMIFS(INDEX(AR:AR,11):INDEX(AR:AR,100000),INDEX($F:$F,11):INDEX($F:$F,100000),$P2,INDEX($J:$J,11):INDEX($J:$J,100000),\"1_Assigned\")\n+SUMIFS(INDEX(AR:AR,11):INDEX(AR:AR,100000),INDEX($F:$F,11):INDEX($F:$F,100000),$P2,INDEX($J:$J,11):INDEX($J:$J,100000),\"2_InProgress\")\n+SUMIFS(INDEX(AR:AR,11):INDEX(AR:AR,100000),INDEX($F:$F,11):INDEX($F:$F,100000),$P2,INDEX($J:$J,11):INDEX($J:$J,100000),\"3_Prototype\")\n+SUMIFS(INDEX(AR:AR,11):INDEX(AR:AR,100000),INDEX($F:$F,11):INDEX($F:$F,100000),$P2,INDEX($J:$J,11):INDEX($J:$J,100000),\"4_Testing\")","v":0},{"$f":"SUM(AT2:AY2)","v":0},{"$f":"SUMIFS(INDEX(AT:AT,11):INDEX(AT:AT,100000),INDEX($F:$F,11):INDEX($F:$F,100000),$P2,INDEX($J:$J,11):INDEX($J:$J,100000),\"0_AttentionNeeded\")\n+SUMIFS(INDEX(AT:AT,11):INDEX(AT:AT,100000),INDEX($F:$F,11):INDEX($F:$F,100000),$P2,INDEX($J:$J,11):INDEX($J:$J,100000),\"1_Assigned\")\n+SUMIFS(INDEX(AT:AT,11):INDEX(AT:AT,100000),INDEX($F:$F,11):INDEX($F:$F,100000),$P2,INDEX($J:$J,11):INDEX($J:$J,100000),\"2_InProgress\")\n+SUMIFS(INDEX(AT:AT,11):INDEX(AT:AT,100000),INDEX($F:$F,11):INDEX($F:$F,100000),$P2,INDEX($J:$J,11):INDEX($J:$J,100000),\"3_Prototype\")\n+SUMIFS(INDEX(AT:AT,11):INDEX(AT:AT,100000),INDEX($F:$F,11):INDEX($F:$F,100000),$P2,INDEX($J:$J,11):INDEX($J:$J,100000),\"4_Testing\")","v":0},{"$f":"SUMIFS(INDEX(AU:AU,11):INDEX(AU:AU,100000),INDEX($F:$F,11):INDEX($F:$F,100000),$P2,INDEX($J:$J,11):INDEX($J:$J,100000),\"0_AttentionNeeded\")\n+SUMIFS(INDEX(AU:AU,11):INDEX(AU:AU,100000),INDEX($F:$F,11):INDEX($F:$F,100000),$P2,INDEX($J:$J,11):INDEX($J:$J,100000),\"1_Assigned\")\n+SUMIFS(INDEX(AU:AU,11):INDEX(AU:AU,100000),INDEX($F:$F,11):INDEX($F:$F,100000),$P2,INDEX($J:$J,11):INDEX($J:$J,100000),\"2_InProgress\")\n+SUMIFS(INDEX(AU:AU,11):INDEX(AU:AU,100000),INDEX($F:$F,11):INDEX($F:$F,100000),$P2,INDEX($J:$J,11):INDEX($J:$J,100000),\"3_Prototype\")\n+SUMIFS(INDEX(AU:AU,11):INDEX(AU:AU,100000),INDEX($F:$F,11):INDEX($F:$F,100000),$P2,INDEX($J:$J,11):INDEX($J:$J,100000),\"4_Testing\")","v":0},{"$f":"SUMIFS(INDEX(AV:AV,11):INDEX(AV:AV,100000),INDEX($F:$F,11):INDEX($F:$F,100000),$P2,INDEX($J:$J,11):INDEX($J:$J,100000),\"0_AttentionNeeded\")\n+SUMIFS(INDEX(AV:AV,11):INDEX(AV:AV,100000),INDEX($F:$F,11):INDEX($F:$F,100000),$P2,INDEX($J:$J,11):INDEX($J:$J,100000),\"1_Assigned\")\n+SUMIFS(INDEX(AV:AV,11):INDEX(AV:AV,100000),INDEX($F:$F,11):INDEX($F:$F,100000),$P2,INDEX($J:$J,11):INDEX($J:$J,100000),\"2_InProgress\")\n+SUMIFS(INDEX(AV:AV,11):INDEX(AV:AV,100000),INDEX($F:$F,11):INDEX($F:$F,100000),$P2,INDEX($J:$J,11):INDEX($J:$J,100000),\"3_Prototype\")\n+SUMIFS(INDEX(AV:AV,11):INDEX(AV:AV,100000),INDEX($F:$F,11):INDEX($F:$F,100000),$P2,INDEX($J:$J,11):INDEX($J:$J,100000),\"4_Testing\")","v":0},{"$f":"SUMIFS(INDEX(AW:AW,11):INDEX(AW:AW,100000),INDEX($F:$F,11):INDEX($F:$F,100000),$P2,INDEX($J:$J,11):INDEX($J:$J,100000),\"0_AttentionNeeded\")\n+SUMIFS(INDEX(AW:AW,11):INDEX(AW:AW,100000),INDEX($F:$F,11):INDEX($F:$F,100000),$P2,INDEX($J:$J,11):INDEX($J:$J,100000),\"1_Assigned\")\n+SUMIFS(INDEX(AW:AW,11):INDEX(AW:AW,100000),INDEX($F:$F,11):INDEX($F:$F,100000),$P2,INDEX($J:$J,11):INDEX($J:$J,100000),\"2_InProgress\")\n+SUMIFS(INDEX(AW:AW,11):INDEX(AW:AW,100000),INDEX($F:$F,11):INDEX($F:$F,100000),$P2,INDEX($J:$J,11):INDEX($J:$J,100000),\"3_Prototype\")\n+SUMIFS(INDEX(AW:AW,11):INDEX(AW:AW,100000),INDEX($F:$F,11):INDEX($F:$F,100000),$P2,INDEX($J:$J,11):INDEX($J:$J,100000),\"4_Testing\")","v":0},{"$f":"SUMIFS(INDEX(AX:AX,11):INDEX(AX:AX,100000),INDEX($F:$F,11):INDEX($F:$F,100000),$P2,INDEX($J:$J,11):INDEX($J:$J,100000),\"0_AttentionNeeded\")\n+SUMIFS(INDEX(AX:AX,11):INDEX(AX:AX,100000),INDEX($F:$F,11):INDEX($F:$F,100000),$P2,INDEX($J:$J,11):INDEX($J:$J,100000),\"1_Assigned\")\n+SUMIFS(INDEX(AX:AX,11):INDEX(AX:AX,100000),INDEX($F:$F,11):INDEX($F:$F,100000),$P2,INDEX($J:$J,11):INDEX($J:$J,100000),\"2_InProgress\")\n+SUMIFS(INDEX(AX:AX,11):INDEX(AX:AX,100000),INDEX($F:$F,11):INDEX($F:$F,100000),$P2,INDEX($J:$J,11):INDEX($J:$J,100000),\"3_Prototype\")\n+SUMIFS(INDEX(AX:AX,11):INDEX(AX:AX,100000),INDEX($F:$F,11):INDEX($F:$F,100000),$P2,INDEX($J:$J,11):INDEX($J:$J,100000),\"4_Testing\")","v":0},{"$f":"SUMIFS(INDEX(AY:AY,11):INDEX(AY:AY,100000),INDEX($F:$F,11):INDEX($F:$F,100000),$P2,INDEX($J:$J,11):INDEX($J:$J,100000),\"0_AttentionNeeded\")\n+SUMIFS(INDEX(AY:AY,11):INDEX(AY:AY,100000),INDEX($F:$F,11):INDEX($F:$F,100000),$P2,INDEX($J:$J,11):INDEX($J:$J,100000),\"1_Assigned\")\n+SUMIFS(INDEX(AY:AY,11):INDEX(AY:AY,100000),INDEX($F:$F,11):INDEX($F:$F,100000),$P2,INDEX($J:$J,11):INDEX($J:$J,100000),\"2_InProgress\")\n+SUMIFS(INDEX(AY:AY,11):INDEX(AY:AY,100000),INDEX($F:$F,11):INDEX($F:$F,100000),$P2,INDEX($J:$J,11):INDEX($J:$J,100000),\"3_Prototype\")\n+SUMIFS(INDEX(AY:AY,11):INDEX(AY:AY,100000),INDEX($F:$F,11):INDEX($F:$F,100000),$P2,INDEX($J:$J,11):INDEX($J:$J,100000),\"4_Testing\")","v":0},{"$f":"SUM(BA2:BF2)","v":0},{"$f":"SUMIFS(INDEX(BA:BA,11):INDEX(BA:BA,100000),INDEX($F:$F,11):INDEX($F:$F,100000),$P2,INDEX($J:$J,11):INDEX($J:$J,100000),\"0_AttentionNeeded\")\n+SUMIFS(INDEX(BA:BA,11):INDEX(BA:BA,100000),INDEX($F:$F,11):INDEX($F:$F,100000),$P2,INDEX($J:$J,11):INDEX($J:$J,100000),\"1_Assigned\")\n+SUMIFS(INDEX(BA:BA,11):INDEX(BA:BA,100000),INDEX($F:$F,11):INDEX($F:$F,100000),$P2,INDEX($J:$J,11):INDEX($J:$J,100000),\"2_InProgress\")\n+SUMIFS(INDEX(BA:BA,11):INDEX(BA:BA,100000),INDEX($F:$F,11):INDEX($F:$F,100000),$P2,INDEX($J:$J,11):INDEX($J:$J,100000),\"3_Prototype\")\n+SUMIFS(INDEX(BA:BA,11):INDEX(BA:BA,100000),INDEX($F:$F,11):INDEX($F:$F,100000),$P2,INDEX($J:$J,11):INDEX($J:$J,100000),\"4_Testing\")","v":0},{"$f":"SUMIFS(INDEX(BB:BB,11):INDEX(BB:BB,100000),INDEX($F:$F,11):INDEX($F:$F,100000),$P2,INDEX($J:$J,11):INDEX($J:$J,100000),\"0_AttentionNeeded\")\n+SUMIFS(INDEX(BB:BB,11):INDEX(BB:BB,100000),INDEX($F:$F,11):INDEX($F:$F,100000),$P2,INDEX($J:$J,11):INDEX($J:$J,100000),\"1_Assigned\")\n+SUMIFS(INDEX(BB:BB,11):INDEX(BB:BB,100000),INDEX($F:$F,11):INDEX($F:$F,100000),$P2,INDEX($J:$J,11):INDEX($J:$J,100000),\"2_InProgress\")\n+SUMIFS(INDEX(BB:BB,11):INDEX(BB:BB,100000),INDEX($F:$F,11):INDEX($F:$F,100000),$P2,INDEX($J:$J,11):INDEX($J:$J,100000),\"3_Prototype\")\n+SUMIFS(INDEX(BB:BB,11):INDEX(BB:BB,100000),INDEX($F:$F,11):INDEX($F:$F,100000),$P2,INDEX($J:$J,11):INDEX($J:$J,100000),\"4_Testing\")","v":0},{"$f":"SUMIFS(INDEX(BC:BC,11):INDEX(BC:BC,100000),INDEX($F:$F,11):INDEX($F:$F,100000),$P2,INDEX($J:$J,11):INDEX($J:$J,100000),\"0_AttentionNeeded\")\n+SUMIFS(INDEX(BC:BC,11):INDEX(BC:BC,100000),INDEX($F:$F,11):INDEX($F:$F,100000),$P2,INDEX($J:$J,11):INDEX($J:$J,100000),\"1_Assigned\")\n+SUMIFS(INDEX(BC:BC,11):INDEX(BC:BC,100000),INDEX($F:$F,11):INDEX($F:$F,100000),$P2,INDEX($J:$J,11):INDEX($J:$J,100000),\"2_InProgress\")\n+SUMIFS(INDEX(BC:BC,11):INDEX(BC:BC,100000),INDEX($F:$F,11):INDEX($F:$F,100000),$P2,INDEX($J:$J,11):INDEX($J:$J,100000),\"3_Prototype\")\n+SUMIFS(INDEX(BC:BC,11):INDEX(BC:BC,100000),INDEX($F:$F,11):INDEX($F:$F,100000),$P2,INDEX($J:$J,11):INDEX($J:$J,100000),\"4_Testing\")","v":0},{"$f":"SUMIFS(INDEX(BD:BD,11):INDEX(BD:BD,100000),INDEX($F:$F,11):INDEX($F:$F,100000),$P2,INDEX($J:$J,11):INDEX($J:$J,100000),\"0_AttentionNeeded\")\n+SUMIFS(INDEX(BD:BD,11):INDEX(BD:BD,100000),INDEX($F:$F,11):INDEX($F:$F,100000),$P2,INDEX($J:$J,11):INDEX($J:$J,100000),\"1_Assigned\")\n+SUMIFS(INDEX(BD:BD,11):INDEX(BD:BD,100000),INDEX($F:$F,11):INDEX($F:$F,100000),$P2,INDEX($J:$J,11):INDEX($J:$J,100000),\"2_InProgress\")\n+SUMIFS(INDEX(BD:BD,11):INDEX(BD:BD,100000),INDEX($F:$F,11):INDEX($F:$F,100000),$P2,INDEX($J:$J,11):INDEX($J:$J,100000),\"3_Prototype\")\n+SUMIFS(INDEX(BD:BD,11):INDEX(BD:BD,100000),INDEX($F:$F,11):INDEX($F:$F,100000),$P2,INDEX($J:$J,11):INDEX($J:$J,100000),\"4_Testing\")","v":0},{"$f":"SUMIFS(INDEX(BE:BE,11):INDEX(BE:BE,100000),INDEX($F:$F,11):INDEX($F:$F,100000),$P2,INDEX($J:$J,11):INDEX($J:$J,100000),\"0_AttentionNeeded\")\n+SUMIFS(INDEX(BE:BE,11):INDEX(BE:BE,100000),INDEX($F:$F,11):INDEX($F:$F,100000),$P2,INDEX($J:$J,11):INDEX($J:$J,100000),\"1_Assigned\")\n+SUMIFS(INDEX(BE:BE,11):INDEX(BE:BE,100000),INDEX($F:$F,11):INDEX($F:$F,100000),$P2,INDEX($J:$J,11):INDEX($J:$J,100000),\"2_InProgress\")\n+SUMIFS(INDEX(BE:BE,11):INDEX(BE:BE,100000),INDEX($F:$F,11):INDEX($F:$F,100000),$P2,INDEX($J:$J,11):INDEX($J:$J,100000),\"3_Prototype\")\n+SUMIFS(INDEX(BE:BE,11):INDEX(BE:BE,100000),INDEX($F:$F,11):INDEX($F:$F,100000),$P2,INDEX($J:$J,11):INDEX($J:$J,100000),\"4_Testing\")","v":0},{"$f":"SUMIFS(INDEX(BF:BF,11):INDEX(BF:BF,100000),INDEX($F:$F,11):INDEX($F:$F,100000),$P2,INDEX($J:$J,11):INDEX($J:$J,100000),\"0_AttentionNeeded\")\n+SUMIFS(INDEX(BF:BF,11):INDEX(BF:BF,100000),INDEX($F:$F,11):INDEX($F:$F,100000),$P2,INDEX($J:$J,11):INDEX($J:$J,100000),\"1_Assigned\")\n+SUMIFS(INDEX(BF:BF,11):INDEX(BF:BF,100000),INDEX($F:$F,11):INDEX($F:$F,100000),$P2,INDEX($J:$J,11):INDEX($J:$J,100000),\"2_InProgress\")\n+SUMIFS(INDEX(BF:BF,11):INDEX(BF:BF,100000),INDEX($F:$F,11):INDEX($F:$F,100000),$P2,INDEX($J:$J,11):INDEX($J:$J,100000),\"3_Prototype\")\n+SUMIFS(INDEX(BF:BF,11):INDEX(BF:BF,100000),INDEX($F:$F,11):INDEX($F:$F,100000),$P2,INDEX($J:$J,11):INDEX($J:$J,100000),\"4_Testing\")","v":0}]
[null,null,null,null,null,null,null,null,null,null,null,null,null,null,null,"IK",{"$f":"SUM(R3:W3)","v":0},{"$f":"SUMIFS(INDEX(R:R,11):INDEX(R:R,100000),INDEX($F:$F,11):INDEX($F:$F,100000),$P3,INDEX($J:$J,11):INDEX($J:$J,100000),\"0_AttentionNeeded\")\n+SUMIFS(INDEX(R:R,11):INDEX(R:R,100000),INDEX($F:$F,11):INDEX($F:$F,100000),$P3,INDEX($J:$J,11):INDEX($J:$J,100000),\"1_Assigned\")\n+SUMIFS(INDEX(R:R,11):INDEX(R:R,100000),INDEX($F:$F,11):INDEX($F:$F,100000),$P3,INDEX($J:$J,11):INDEX($J:$J,100000),\"2_InProgress\")\n+SUMIFS(INDEX(R:R,11):INDEX(R:R,100000),INDEX($F:$F,11):INDEX($F:$F,100000),$P3,INDEX($J:$J,11):INDEX($J:$J,100000),\"3_Prototype\")\n+SUMIFS(INDEX(R:R,11):INDEX(R:R,100000),INDEX($F:$F,11):INDEX($F:$F,100000),$P3,INDEX($J:$J,11):INDEX($J:$J,100000),\"4_Testing\")","v":0},{"$f":"SUMIFS(INDEX(S:S,11):INDEX(S:S,100000),INDEX($F:$F,11):INDEX($F:$F,100000),$P3,INDEX($J:$J,11):INDEX($J:$J,100000),\"0_AttentionNeeded\")\n+SUMIFS(INDEX(S:S,11):INDEX(S:S,100000),INDEX($F:$F,11):INDEX($F:$F,100000),$P3,INDEX($J:$J,11):INDEX($J:$J,100000),\"1_Assigned\")\n+SUMIFS(INDEX(S:S,11):INDEX(S:S,100000),INDEX($F:$F,11):INDEX($F:$F,100000),$P3,INDEX($J:$J,11):INDEX($J:$J,100000),\"2_InProgress\")\n+SUMIFS(INDEX(S:S,11):INDEX(S:S,100000),INDEX($F:$F,11):INDEX($F:$F,100000),$P3,INDEX($J:$J,11):INDEX($J:$J,100000),\"3_Prototype\")\n+SUMIFS(INDEX(S:S,11):INDEX(S:S,100000),INDEX($F:$F,11):INDEX($F:$F,100000),$P3,INDEX($J:$J,11):INDEX($J:$J,100000),\"4_Testing\")","v":0},{"$f":"SUMIFS(INDEX(T:T,11):INDEX(T:T,100000),INDEX($F:$F,11):INDEX($F:$F,100000),$P3,INDEX($J:$J,11):INDEX($J:$J,100000),\"0_AttentionNeeded\")\n+SUMIFS(INDEX(T:T,11):INDEX(T:T,100000),INDEX($F:$F,11):INDEX($F:$F,100000),$P3,INDEX($J:$J,11):INDEX($J:$J,100000),\"1_Assigned\")\n+SUMIFS(INDEX(T:T,11):INDEX(T:T,100000),INDEX($F:$F,11):INDEX($F:$F,100000),$P3,INDEX($J:$J,11):INDEX($J:$J,100000),\"2_InProgress\")\n+SUMIFS(INDEX(T:T,11):INDEX(T:T,100000),INDEX($F:$F,11):INDEX($F:$F,100000),$P3,INDEX($J:$J,11):INDEX($J:$J,100000),\"3_Prototype\")\n+SUMIFS(INDEX(T:T,11):INDEX(T:T,100000),INDEX($F:$F,11):INDEX($F:$F,100000),$P3,INDEX($J:$J,11):INDEX($J:$J,100000),\"4_Testing\")","v":0},{"$f":"SUMIFS(INDEX(U:U,11):INDEX(U:U,100000),INDEX($F:$F,11):INDEX($F:$F,100000),$P3,INDEX($J:$J,11):INDEX($J:$J,100000),\"0_AttentionNeeded\")\n+SUMIFS(INDEX(U:U,11):INDEX(U:U,100000),INDEX($F:$F,11):INDEX($F:$F,100000),$P3,INDEX($J:$J,11):INDEX($J:$J,100000),\"1_Assigned\")\n+SUMIFS(INDEX(U:U,11):INDEX(U:U,100000),INDEX($F:$F,11):INDEX($F:$F,100000),$P3,INDEX($J:$J,11):INDEX($J:$J,100000),\"2_InProgress\")\n+SUMIFS(INDEX(U:U,11):INDEX(U:U,100000),INDEX($F:$F,11):INDEX($F:$F,100000),$P3,INDEX($J:$J,11):INDEX($J:$J,100000),\"3_Prototype\")\n+SUMIFS(INDEX(U:U,11):INDEX(U:U,100000),INDEX($F:$F,11):INDEX($F:$F,100000),$P3,INDEX($J:$J,11):INDEX($J:$J,100000),\"4_Testing\")","v":0},{"$f":"SUMIFS(INDEX(V:V,11):INDEX(V:V,100000),INDEX($F:$F,11):INDEX($F:$F,100000),$P3,INDEX($J:$J,11):INDEX($J:$J,100000),\"0_AttentionNeeded\")\n+SUMIFS(INDEX(V:V,11):INDEX(V:V,100000),INDEX($F:$F,11):INDEX($F:$F,100000),$P3,INDEX($J:$J,11):INDEX($J:$J,100000),\"1_Assigned\")\n+SUMIFS(INDEX(V:V,11):INDEX(V:V,100000),INDEX($F:$F,11):INDEX($F:$F,100000),$P3,INDEX($J:$J,11):INDEX($J:$J,100000),\"2_InProgress\")\n+SUMIFS(INDEX(V:V,11):INDEX(V:V,100000),INDEX($F:$F,11):INDEX($F:$F,100000),$P3,INDEX($J:$J,11):INDEX($J:$J,100000),\"3_Prototype\")\n+SUMIFS(INDEX(V:V,11):INDEX(V:V,100000),INDEX($F:$F,11):INDEX($F:$F,100000),$P3,INDEX($J:$J,11):INDEX($J:$J,100000),\"4_Testing\")","v":0},{"$f":"SUMIFS(INDEX(W:W,11):INDEX(W:W,100000),INDEX($F:$F,11):INDEX($F:$F,100000),$P3,INDEX($J:$J,11):INDEX($J:$J,100000),\"0_AttentionNeeded\")\n+SUMIFS(INDEX(W:W,11):INDEX(W:W,100000),INDEX($F:$F,11):INDEX($F:$F,100000),$P3,INDEX($J:$J,11):INDEX($J:$J,100000),\"1_Assigned\")\n+SUMIFS(INDEX(W:W,11):INDEX(W:W,100000),INDEX($F:$F,11):INDEX($F:$F,100000),$P3,INDEX($J:$J,11):INDEX($J:$J,100000),\"2_InProgress\")\n+SUMIFS(INDEX(W:W,11):INDEX(W:W,100000),INDEX($F:$F,11):INDEX($F:$F,100000),$P3,INDEX($J:$J,11):INDEX($J:$J,100000),\"3_Prototype\")\n+SUMIFS(INDEX(W:W,11):INDEX(W:W,100000),INDEX($F:$F,11):INDEX($F:$F,100000),$P3,INDEX($J:$J,11):INDEX($J:$J,100000),\"4_Testing\")","v":0},{"$f":"SUM(Y3:AD3)","v":0},{"$f":"SUMIFS(INDEX(Y:Y,11):INDEX(Y:Y,100000),INDEX($F:$F,11):INDEX($F:$F,100000),$P3,INDEX($J:$J,11):INDEX($J:$J,100000),\"0_AttentionNeeded\")\n+SUMIFS(INDEX(Y:Y,11):INDEX(Y:Y,100000),INDEX($F:$F,11):INDEX($F:$F,100000),$P3,INDEX($J:$J,11):INDEX($J:$J,100000),\"1_Assigned\")\n+SUMIFS(INDEX(Y:Y,11):INDEX(Y:Y,100000),INDEX($F:$F,11):INDEX($F:$F,100000),$P3,INDEX($J:$J,11):INDEX($J:$J,100000),\"2_InProgress\")\n+SUMIFS(INDEX(Y:Y,11):INDEX(Y:Y,100000),INDEX($F:$F,11):INDEX($F:$F,100000),$P3,INDEX($J:$J,11):INDEX($J:$J,100000),\"3_Prototype\")\n+SUMIFS(INDEX(Y:Y,11):INDEX(Y:Y,100000),INDEX($F:$F,11):INDEX($F:$F,100000),$P3,INDEX($J:$J,11):INDEX($J:$J,100000),\"4_Testing\")","v":0},{"$f":"SUMIFS(INDEX(Z:Z,11):INDEX(Z:Z,100000),INDEX($F:$F,11):INDEX($F:$F,100000),$P3,INDEX($J:$J,11):INDEX($J:$J,100000),\"0_AttentionNeeded\")\n+SUMIFS(INDEX(Z:Z,11):INDEX(Z:Z,100000),INDEX($F:$F,11):INDEX($F:$F,100000),$P3,INDEX($J:$J,11):INDEX($J:$J,100000),\"1_Assigned\")\n+SUMIFS(INDEX(Z:Z,11):INDEX(Z:Z,100000),INDEX($F:$F,11):INDEX($F:$F,100000),$P3,INDEX($J:$J,11):INDEX($J:$J,100000),\"2_InProgress\")\n+SUMIFS(INDEX(Z:Z,11):INDEX(Z:Z,100000),INDEX($F:$F,11):INDEX($F:$F,100000),$P3,INDEX($J:$J,11):INDEX($J:$J,100000),\"3_Prototype\")\n+SUMIFS(INDEX(Z:Z,11):INDEX(Z:Z,100000),INDEX($F:$F,11):INDEX($F:$F,100000),$P3,INDEX($J:$J,11):INDEX($J:$J,100000),\"4_Testing\")","v":0},{"$f":"SUMIFS(INDEX(AA:AA,11):INDEX(AA:AA,100000),INDEX($F:$F,11):INDEX($F:$F,100000),$P3,INDEX($J:$J,11):INDEX($J:$J,100000),\"0_AttentionNeeded\")\n+SUMIFS(INDEX(AA:AA,11):INDEX(AA:AA,100000),INDEX($F:$F,11):INDEX($F:$F,100000),$P3,INDEX($J:$J,11):INDEX($J:$J,100000),\"1_Assigned\")\n+SUMIFS(INDEX(AA:AA,11):INDEX(AA:AA,100000),INDEX($F:$F,11):INDEX($F:$F,100000),$P3,INDEX($J:$J,11):INDEX($J:$J,100000),\"2_InProgress\")\n+SUMIFS(INDEX(AA:AA,11):INDEX(AA:AA,100000),INDEX($F:$F,11):INDEX($F:$F,100000),$P3,INDEX($J:$J,11):INDEX($J:$J,100000),\"3_Prototype\")\n+SUMIFS(INDEX(AA:AA,11):INDEX(AA:AA,100000),INDEX($F:$F,11):INDEX($F:$F,100000),$P3,INDEX($J:$J,11):INDEX($J:$J,100000),\"4_Testing\")","v":0},{"$f":"SUMIFS(INDEX(AB:AB,11):INDEX(AB:AB,100000),INDEX($F:$F,11):INDEX($F:$F,100000),$P3,INDEX($J:$J,11):INDEX($J:$J,100000),\"0_AttentionNeeded\")\n+SUMIFS(INDEX(AB:AB,11):INDEX(AB:AB,100000),INDEX($F:$F,11):INDEX($F:$F,100000),$P3,INDEX($J:$J,11):INDEX($J:$J,100000),\"1_Assigned\")\n+SUMIFS(INDEX(AB:AB,11):INDEX(AB:AB,100000),INDEX($F:$F,11):INDEX($F:$F,100000),$P3,INDEX($J:$J,11):INDEX($J:$J,100000),\"2_InProgress\")\n+SUMIFS(INDEX(AB:AB,11):INDEX(AB:AB,100000),INDEX($F:$F,11):INDEX($F:$F,100000),$P3,INDEX($J:$J,11):INDEX($J:$J,100000),\"3_Prototype\")\n+SUMIFS(INDEX(AB:AB,11):INDEX(AB:AB,100000),INDEX($F:$F,11):INDEX($F:$F,100000),$P3,INDEX($J:$J,11):INDEX($J:$J,100000),\"4_Testing\")","v":0},{"$f":"SUMIFS(INDEX(AC:AC,11):INDEX(AC:AC,100000),INDEX($F:$F,11):INDEX($F:$F,100000),$P3,INDEX($J:$J,11):INDEX($J:$J,100000),\"0_AttentionNeeded\")\n+SUMIFS(INDEX(AC:AC,11):INDEX(AC:AC,100000),INDEX($F:$F,11):INDEX($F:$F,100000),$P3,INDEX($J:$J,11):INDEX($J:$J,100000),\"1_Assigned\")\n+SUMIFS(INDEX(AC:AC,11):INDEX(AC:AC,100000),INDEX($F:$F,11):INDEX($F:$F,100000),$P3,INDEX($J:$J,11):INDEX($J:$J,100000),\"2_InProgress\")\n+SUMIFS(INDEX(AC:AC,11):INDEX(AC:AC,100000),INDEX($F:$F,11):INDEX($F:$F,100000),$P3,INDEX($J:$J,11):INDEX($J:$J,100000),\"3_Prototype\")\n+SUMIFS(INDEX(AC:AC,11):INDEX(AC:AC,100000),INDEX($F:$F,11):INDEX($F:$F,100000),$P3,INDEX($J:$J,11):INDEX($J:$J,100000),\"4_Testing\")","v":0},{"$f":"SUMIFS(INDEX(AD:AD,11):INDEX(AD:AD,100000),INDEX($F:$F,11):INDEX($F:$F,100000),$P3,INDEX($J:$J,11):INDEX($J:$J,100000),\"0_AttentionNeeded\")\n+SUMIFS(INDEX(AD:AD,11):INDEX(AD:AD,100000),INDEX($F:$F,11):INDEX($F:$F,100000),$P3,INDEX($J:$J,11):INDEX($J:$J,100000),\"1_Assigned\")\n+SUMIFS(INDEX(AD:AD,11):INDEX(AD:AD,100000),INDEX($F:$F,11):INDEX($F:$F,100000),$P3,INDEX($J:$J,11):INDEX($J:$J,100000),\"2_InProgress\")\n+SUMIFS(INDEX(AD:AD,11):INDEX(AD:AD,100000),INDEX($F:$F,11):INDEX($F:$F,100000),$P3,INDEX($J:$J,11):INDEX($J:$J,100000),\"3_Prototype\")\n+SUMIFS(INDEX(AD:AD,11):INDEX(AD:AD,100000),INDEX($F:$F,11):INDEX($F:$F,100000),$P3,INDEX($J:$J,11):INDEX($J:$J,100000),\"4_Testing\")","v":0},{"$f":"SUM(AF3:AK3)","v":0},{"$f":"SUMIFS(INDEX(AF:AF,11):INDEX(AF:AF,100000),INDEX($F:$F,11):INDEX($F:$F,100000),$P3,INDEX($J:$J,11):INDEX($J:$J,100000),\"0_AttentionNeeded\")\n+SUMIFS(INDEX(AF:AF,11):INDEX(AF:AF,100000),INDEX($F:$F,11):INDEX($F:$F,100000),$P3,INDEX($J:$J,11):INDEX($J:$J,100000),\"1_Assigned\")\n+SUMIFS(INDEX(AF:AF,11):INDEX(AF:AF,100000),INDEX($F:$F,11):INDEX($F:$F,100000),$P3,INDEX($J:$J,11):INDEX($J:$J,100000),\"2_InProgress\")\n+SUMIFS(INDEX(AF:AF,11):INDEX(AF:AF,100000),INDEX($F:$F,11):INDEX($F:$F,100000),$P3,INDEX($J:$J,11):INDEX($J:$J,100000),\"3_Prototype\")\n+SUMIFS(INDEX(AF:AF,11):INDEX(AF:AF,100000),INDEX($F:$F,11):INDEX($F:$F,100000),$P3,INDEX($J:$J,11):INDEX($J:$J,100000),\"4_Testing\")","v":0},{"$f":"SUMIFS(INDEX(AG:AG,11):INDEX(AG:AG,100000),INDEX($F:$F,11):INDEX($F:$F,100000),$P3,INDEX($J:$J,11):INDEX($J:$J,100000),\"0_AttentionNeeded\")\n+SUMIFS(INDEX(AG:AG,11):INDEX(AG:AG,100000),INDEX($F:$F,11):INDEX($F:$F,100000),$P3,INDEX($J:$J,11):INDEX($J:$J,100000),\"1_Assigned\")\n+SUMIFS(INDEX(AG:AG,11):INDEX(AG:AG,100000),INDEX($F:$F,11):INDEX($F:$F,100000),$P3,INDEX($J:$J,11):INDEX($J:$J,100000),\"2_InProgress\")\n+SUMIFS(INDEX(AG:AG,11):INDEX(AG:AG,100000),INDEX($F:$F,11):INDEX($F:$F,100000),$P3,INDEX($J:$J,11):INDEX($J:$J,100000),\"3_Prototype\")\n+SUMIFS(INDEX(AG:AG,11):INDEX(AG:AG,100000),INDEX($F:$F,11):INDEX($F:$F,100000),$P3,INDEX($J:$J,11):INDEX($J:$J,100000),\"4_Testing\")","v":0},{"$f":"SUMIFS(INDEX(AH:AH,11):INDEX(AH:AH,100000),INDEX($F:$F,11):INDEX($F:$F,100000),$P3,INDEX($J:$J,11):INDEX($J:$J,100000),\"0_AttentionNeeded\")\n+SUMIFS(INDEX(AH:AH,11):INDEX(AH:AH,100000),INDEX($F:$F,11):INDEX($F:$F,100000),$P3,INDEX($J:$J,11):INDEX($J:$J,100000),\"1_Assigned\")\n+SUMIFS(INDEX(AH:AH,11):INDEX(AH:AH,100000),INDEX($F:$F,11):INDEX($F:$F,100000),$P3,INDEX($J:$J,11):INDEX($J:$J,100000),\"2_InProgress\")\n+SUMIFS(INDEX(AH:AH,11):INDEX(AH:AH,100000),INDEX($F:$F,11):INDEX($F:$F,100000),$P3,INDEX($J:$J,11):INDEX($J:$J,100000),\"3_Prototype\")\n+SUMIFS(INDEX(AH:AH,11):INDEX(AH:AH,100000),INDEX($F:$F,11):INDEX($F:$F,100000),$P3,INDEX($J:$J,11):INDEX($J:$J,100000),\"4_Testing\")","v":0},{"$f":"SUMIFS(INDEX(AI:AI,11):INDEX(AI:AI,100000),INDEX($F:$F,11):INDEX($F:$F,100000),$P3,INDEX($J:$J,11):INDEX($J:$J,100000),\"0_AttentionNeeded\")\n+SUMIFS(INDEX(AI:AI,11):INDEX(AI:AI,100000),INDEX($F:$F,11):INDEX($F:$F,100000),$P3,INDEX($J:$J,11):INDEX($J:$J,100000),\"1_Assigned\")\n+SUMIFS(INDEX(AI:AI,11):INDEX(AI:AI,100000),INDEX($F:$F,11):INDEX($F:$F,100000),$P3,INDEX($J:$J,11):INDEX($J:$J,100000),\"2_InProgress\")\n+SUMIFS(INDEX(AI:AI,11):INDEX(AI:AI,100000),INDEX($F:$F,11):INDEX($F:$F,100000),$P3,INDEX($J:$J,11):INDEX($J:$J,100000),\"3_Prototype\")\n+SUMIFS(INDEX(AI:AI,11):INDEX(AI:AI,100000),INDEX($F:$F,11):INDEX($F:$F,100000),$P3,INDEX($J:$J,11):INDEX($J:$J,100000),\"4_Testing\")","v":0},{"$f":"SUMIFS(INDEX(AJ:AJ,11):INDEX(AJ:AJ,100000),INDEX($F:$F,11):INDEX($F:$F,100000),$P3,INDEX($J:$J,11):INDEX($J:$J,100000),\"0_AttentionNeeded\")\n+SUMIFS(INDEX(AJ:AJ,11):INDEX(AJ:AJ,100000),INDEX($F:$F,11):INDEX($F:$F,100000),$P3,INDEX($J:$J,11):INDEX($J:$J,100000),\"1_Assigned\")\n+SUMIFS(INDEX(AJ:AJ,11):INDEX(AJ:AJ,100000),INDEX($F:$F,11):INDEX($F:$F,100000),$P3,INDEX($J:$J,11):INDEX($J:$J,100000),\"2_InProgress\")\n+SUMIFS(INDEX(AJ:AJ,11):INDEX(AJ:AJ,100000),INDEX($F:$F,11):INDEX($F:$F,100000),$P3,INDEX($J:$J,11):INDEX($J:$J,100000),\"3_Prototype\")\n+SUMIFS(INDEX(AJ:AJ,11):INDEX(AJ:AJ,100000),INDEX($F:$F,11):INDEX($F:$F,100000),$P3,INDEX($J:$J,11):INDEX($J:$J,100000),\"4_Testing\")","v":0},{"$f":"SUMIFS(INDEX(AK:AK,11):INDEX(AK:AK,100000),INDEX($F:$F,11):INDEX($F:$F,100000),$P3,INDEX($J:$J,11):INDEX($J:$J,100000),\"0_AttentionNeeded\")\n+SUMIFS(INDEX(AK:AK,11):INDEX(AK:AK,100000),INDEX($F:$F,11):INDEX($F:$F,100000),$P3,INDEX($J:$J,11):INDEX($J:$J,100000),\"1_Assigned\")\n+SUMIFS(INDEX(AK:AK,11):INDEX(AK:AK,100000),INDEX($F:$F,11):INDEX($F:$F,100000),$P3,INDEX($J:$J,11):INDEX($J:$J,100000),\"2_InProgress\")\n+SUMIFS(INDEX(AK:AK,11):INDEX(AK:AK,100000),INDEX($F:$F,11):INDEX($F:$F,100000),$P3,INDEX($J:$J,11):INDEX($J:$J,100000),\"3_Prototype\")\n+SUMIFS(INDEX(AK:AK,11):INDEX(AK:AK,100000),INDEX($F:$F,11):INDEX($F:$F,100000),$P3,INDEX($J:$J,11):INDEX($J:$J,100000),\"4_Testing\")","v":0},{"$f":"SUM(AM3:AR3)","v":0},{"$f":"SUMIFS(INDEX(AM:AM,11):INDEX(AM:AM,100000),INDEX($F:$F,11):INDEX($F:$F,100000),$P3,INDEX($J:$J,11):INDEX($J:$J,100000),\"0_AttentionNeeded\")\n+SUMIFS(INDEX(AM:AM,11):INDEX(AM:AM,100000),INDEX($F:$F,11):INDEX($F:$F,100000),$P3,INDEX($J:$J,11):INDEX($J:$J,100000),\"1_Assigned\")\n+SUMIFS(INDEX(AM:AM,11):INDEX(AM:AM,100000),INDEX($F:$F,11):INDEX($F:$F,100000),$P3,INDEX($J:$J,11):INDEX($J:$J,100000),\"2_InProgress\")\n+SUMIFS(INDEX(AM:AM,11):INDEX(AM:AM,100000),INDEX($F:$F,11):INDEX($F:$F,100000),$P3,INDEX($J:$J,11):INDEX($J:$J,100000),\"3_Prototype\")\n+SUMIFS(INDEX(AM:AM,11):INDEX(AM:AM,100000),INDEX($F:$F,11):INDEX($F:$F,100000),$P3,INDEX($J:$J,11):INDEX($J:$J,100000),\"4_Testing\")","v":0},{"$f":"SUMIFS(INDEX(AN:AN,11):INDEX(AN:AN,100000),INDEX($F:$F,11):INDEX($F:$F,100000),$P3,INDEX($J:$J,11):INDEX($J:$J,100000),\"0_AttentionNeeded\")\n+SUMIFS(INDEX(AN:AN,11):INDEX(AN:AN,100000),INDEX($F:$F,11):INDEX($F:$F,100000),$P3,INDEX($J:$J,11):INDEX($J:$J,100000),\"1_Assigned\")\n+SUMIFS(INDEX(AN:AN,11):INDEX(AN:AN,100000),INDEX($F:$F,11):INDEX($F:$F,100000),$P3,INDEX($J:$J,11):INDEX($J:$J,100000),\"2_InProgress\")\n+SUMIFS(INDEX(AN:AN,11):INDEX(AN:AN,100000),INDEX($F:$F,11):INDEX($F:$F,100000),$P3,INDEX($J:$J,11):INDEX($J:$J,100000),\"3_Prototype\")\n+SUMIFS(INDEX(AN:AN,11):INDEX(AN:AN,100000),INDEX($F:$F,11):INDEX($F:$F,100000),$P3,INDEX($J:$J,11):INDEX($J:$J,100000),\"4_Testing\")","v":0},{"$f":"SUMIFS(INDEX(AO:AO,11):INDEX(AO:AO,100000),INDEX($F:$F,11):INDEX($F:$F,100000),$P3,INDEX($J:$J,11):INDEX($J:$J,100000),\"0_AttentionNeeded\")\n+SUMIFS(INDEX(AO:AO,11):INDEX(AO:AO,100000),INDEX($F:$F,11):INDEX($F:$F,100000),$P3,INDEX($J:$J,11):INDEX($J:$J,100000),\"1_Assigned\")\n+SUMIFS(INDEX(AO:AO,11):INDEX(AO:AO,100000),INDEX($F:$F,11):INDEX($F:$F,100000),$P3,INDEX($J:$J,11):INDEX($J:$J,100000),\"2_InProgress\")\n+SUMIFS(INDEX(AO:AO,11):INDEX(AO:AO,100000),INDEX($F:$F,11):INDEX($F:$F,100000),$P3,INDEX($J:$J,11):INDEX($J:$J,100000),\"3_Prototype\")\n+SUMIFS(INDEX(AO:AO,11):INDEX(AO:AO,100000),INDEX($F:$F,11):INDEX($F:$F,100000),$P3,INDEX($J:$J,11):INDEX($J:$J,100000),\"4_Testing\")","v":0},{"$f":"SUMIFS(INDEX(AP:AP,11):INDEX(AP:AP,100000),INDEX($F:$F,11):INDEX($F:$F,100000),$P3,INDEX($J:$J,11):INDEX($J:$J,100000),\"0_AttentionNeeded\")\n+SUMIFS(INDEX(AP:AP,11):INDEX(AP:AP,100000),INDEX($F:$F,11):INDEX($F:$F,100000),$P3,INDEX($J:$J,11):INDEX($J:$J,100000),\"1_Assigned\")\n+SUMIFS(INDEX(AP:AP,11):INDEX(AP:AP,100000),INDEX($F:$F,11):INDEX($F:$F,100000),$P3,INDEX($J:$J,11):INDEX($J:$J,100000),\"2_InProgress\")\n+SUMIFS(INDEX(AP:AP,11):INDEX(AP:AP,100000),INDEX($F:$F,11):INDEX($F:$F,100000),$P3,INDEX($J:$J,11):INDEX($J:$J,100000),\"3_Prototype\")\n+SUMIFS(INDEX(AP:AP,11):INDEX(AP:AP,100000),INDEX($F:$F,11):INDEX($F:$F,100000),$P3,INDEX($J:$J,11):INDEX($J:$J,100000),\"4_Testing\")","v":0},{"$f":"SUMIFS(INDEX(AQ:AQ,11):INDEX(AQ:AQ,100000),INDEX($F:$F,11):INDEX($F:$F,100000),$P3,INDEX($J:$J,11):INDEX($J:$J,100000),\"0_AttentionNeeded\")\n+SUMIFS(INDEX(AQ:AQ,11):INDEX(AQ:AQ,100000),INDEX($F:$F,11):INDEX($F:$F,100000),$P3,INDEX($J:$J,11):INDEX($J:$J,100000),\"1_Assigned\")\n+SUMIFS(INDEX(AQ:AQ,11):INDEX(AQ:AQ,100000),INDEX($F:$F,11):INDEX($F:$F,100000),$P3,INDEX($J:$J,11):INDEX($J:$J,100000),\"2_InProgress\")\n+SUMIFS(INDEX(AQ:AQ,11):INDEX(AQ:AQ,100000),INDEX($F:$F,11):INDEX($F:$F,100000),$P3,INDEX($J:$J,11):INDEX($J:$J,100000),\"3_Prototype\")\n+SUMIFS(INDEX(AQ:AQ,11):INDEX(AQ:AQ,100000),INDEX($F:$F,11):INDEX($F:$F,100000),$P3,INDEX($J:$J,11):INDEX($J:$J,100000),\"4_Testing\")","v":0},{"$f":"SUMIFS(INDEX(AR:AR,11):INDEX(AR:AR,100000),INDEX($F:$F,11):INDEX($F:$F,100000),$P3,INDEX($J:$J,11):INDEX($J:$J,100000),\"0_AttentionNeeded\")\n+SUMIFS(INDEX(AR:AR,11):INDEX(AR:AR,100000),INDEX($F:$F,11):INDEX($F:$F,100000),$P3,INDEX($J:$J,11):INDEX($J:$J,100000),\"1_Assigned\")\n+SUMIFS(INDEX(AR:AR,11):INDEX(AR:AR,100000),INDEX($F:$F,11):INDEX($F:$F,100000),$P3,INDEX($J:$J,11):INDEX($J:$J,100000),\"2_InProgress\")\n+SUMIFS(INDEX(AR:AR,11):INDEX(AR:AR,100000),INDEX($F:$F,11):INDEX($F:$F,100000),$P3,INDEX($J:$J,11):INDEX($J:$J,100000),\"3_Prototype\")\n+SUMIFS(INDEX(AR:AR,11):INDEX(AR:AR,100000),INDEX($F:$F,11):INDEX($F:$F,100000),$P3,INDEX($J:$J,11):INDEX($J:$J,100000),\"4_Testing\")","v":0},{"$f":"SUM(AT3:AY3)","v":0},{"$f":"SUMIFS(INDEX(AT:AT,11):INDEX(AT:AT,100000),INDEX($F:$F,11):INDEX($F:$F,100000),$P3,INDEX($J:$J,11):INDEX($J:$J,100000),\"0_AttentionNeeded\")\n+SUMIFS(INDEX(AT:AT,11):INDEX(AT:AT,100000),INDEX($F:$F,11):INDEX($F:$F,100000),$P3,INDEX($J:$J,11):INDEX($J:$J,100000),\"1_Assigned\")\n+SUMIFS(INDEX(AT:AT,11):INDEX(AT:AT,100000),INDEX($F:$F,11):INDEX($F:$F,100000),$P3,INDEX($J:$J,11):INDEX($J:$J,100000),\"2_InProgress\")\n+SUMIFS(INDEX(AT:AT,11):INDEX(AT:AT,100000),INDEX($F:$F,11):INDEX($F:$F,100000),$P3,INDEX($J:$J,11):INDEX($J:$J,100000),\"3_Prototype\")\n+SUMIFS(INDEX(AT:AT,11):INDEX(AT:AT,100000),INDEX($F:$F,11):INDEX($F:$F,100000),$P3,INDEX($J:$J,11):INDEX($J:$J,100000),\"4_Testing\")","v":0},{"$f":"SUMIFS(INDEX(AU:AU,11):INDEX(AU:AU,100000),INDEX($F:$F,11):INDEX($F:$F,100000),$P3,INDEX($J:$J,11):INDEX($J:$J,100000),\"0_AttentionNeeded\")\n+SUMIFS(INDEX(AU:AU,11):INDEX(AU:AU,100000),INDEX($F:$F,11):INDEX($F:$F,100000),$P3,INDEX($J:$J,11):INDEX($J:$J,100000),\"1_Assigned\")\n+SUMIFS(INDEX(AU:AU,11):INDEX(AU:AU,100000),INDEX($F:$F,11):INDEX($F:$F,100000),$P3,INDEX($J:$J,11):INDEX($J:$J,100000),\"2_InProgress\")\n+SUMIFS(INDEX(AU:AU,11):INDEX(AU:AU,100000),INDEX($F:$F,11):INDEX($F:$F,100000),$P3,INDEX($J:$J,11):INDEX($J:$J,100000),\"3_Prototype\")\n+SUMIFS(INDEX(AU:AU,11):INDEX(AU:AU,100000),INDEX($F:$F,11):INDEX($F:$F,100000),$P3,INDEX($J:$J,11):INDEX($J:$J,100000),\"4_Testing\")","v":0},{"$f":"SUMIFS(INDEX(AV:AV,11):INDEX(AV:AV,100000),INDEX($F:$F,11):INDEX($F:$F,100000),$P3,INDEX($J:$J,11):INDEX($J:$J,100000),\"0_AttentionNeeded\")\n+SUMIFS(INDEX(AV:AV,11):INDEX(AV:AV,100000),INDEX($F:$F,11):INDEX($F:$F,100000),$P3,INDEX($J:$J,11):INDEX($J:$J,100000),\"1_Assigned\")\n+SUMIFS(INDEX(AV:AV,11):INDEX(AV:AV,100000),INDEX($F:$F,11):INDEX($F:$F,100000),$P3,INDEX($J:$J,11):INDEX($J:$J,100000),\"2_InProgress\")\n+SUMIFS(INDEX(AV:AV,11):INDEX(AV:AV,100000),INDEX($F:$F,11):INDEX($F:$F,100000),$P3,INDEX($J:$J,11):INDEX($J:$J,100000),\"3_Prototype\")\n+SUMIFS(INDEX(AV:AV,11):INDEX(AV:AV,100000),INDEX($F:$F,11):INDEX($F:$F,100000),$P3,INDEX($J:$J,11):INDEX($J:$J,100000),\"4_Testing\")","v":0},{"$f":"SUMIFS(INDEX(AW:AW,11):INDEX(AW:AW,100000),INDEX($F:$F,11):INDEX($F:$F,100000),$P3,INDEX($J:$J,11):INDEX($J:$J,100000),\"0_AttentionNeeded\")\n+SUMIFS(INDEX(AW:AW,11):INDEX(AW:AW,100000),INDEX($F:$F,11):INDEX($F:$F,100000),$P3,INDEX($J:$J,11):INDEX($J:$J,100000),\"1_Assigned\")\n+SUMIFS(INDEX(AW:AW,11):INDEX(AW:AW,100000),INDEX($F:$F,11):INDEX($F:$F,100000),$P3,INDEX($J:$J,11):INDEX($J:$J,100000),\"2_InProgress\")\n+SUMIFS(INDEX(AW:AW,11):INDEX(AW:AW,100000),INDEX($F:$F,11):INDEX($F:$F,100000),$P3,INDEX($J:$J,11):INDEX($J:$J,100000),\"3_Prototype\")\n+SUMIFS(INDEX(AW:AW,11):INDEX(AW:AW,100000),INDEX($F:$F,11):INDEX($F:$F,100000),$P3,INDEX($J:$J,11):INDEX($J:$J,100000),\"4_Testing\")","v":0},{"$f":"SUMIFS(INDEX(AX:AX,11):INDEX(AX:AX,100000),INDEX($F:$F,11):INDEX($F:$F,100000),$P3,INDEX($J:$J,11):INDEX($J:$J,100000),\"0_AttentionNeeded\")\n+SUMIFS(INDEX(AX:AX,11):INDEX(AX:AX,100000),INDEX($F:$F,11):INDEX($F:$F,100000),$P3,INDEX($J:$J,11):INDEX($J:$J,100000),\"1_Assigned\")\n+SUMIFS(INDEX(AX:AX,11):INDEX(AX:AX,100000),INDEX($F:$F,11):INDEX($F:$F,100000),$P3,INDEX($J:$J,11):INDEX($J:$J,100000),\"2_InProgress\")\n+SUMIFS(INDEX(AX:AX,11):INDEX(AX:AX,100000),INDEX($F:$F,11):INDEX($F:$F,100000),$P3,INDEX($J:$J,11):INDEX($J:$J,100000),\"3_Prototype\")\n+SUMIFS(INDEX(AX:AX,11):INDEX(AX:AX,100000),INDEX($F:$F,11):INDEX($F:$F,100000),$P3,INDEX($J:$J,11):INDEX($J:$J,100000),\"4_Testing\")","v":0},{"$f":"SUMIFS(INDEX(AY:AY,11):INDEX(AY:AY,100000),INDEX($F:$F,11):INDEX($F:$F,100000),$P3,INDEX($J:$J,11):INDEX($J:$J,100000),\"0_AttentionNeeded\")\n+SUMIFS(INDEX(AY:AY,11):INDEX(AY:AY,100000),INDEX($F:$F,11):INDEX($F:$F,100000),$P3,INDEX($J:$J,11):INDEX($J:$J,100000),\"1_Assigned\")\n+SUMIFS(INDEX(AY:AY,11):INDEX(AY:AY,100000),INDEX($F:$F,11):INDEX($F:$F,100000),$P3,INDEX($J:$J,11):INDEX($J:$J,100000),\"2_InProgress\")\n+SUMIFS(INDEX(AY:AY,11):INDEX(AY:AY,100000),INDEX($F:$F,11):INDEX($F:$F,100000),$P3,INDEX($J:$J,11):INDEX($J:$J,100000),\"3_Prototype\")\n+SUMIFS(INDEX(AY:AY,11):INDEX(AY:AY,100000),INDEX($F:$F,11):INDEX($F:$F,100000),$P3,INDEX($J:$J,11):INDEX($J:$J,100000),\"4_Testing\")","v":0},{"$f":"SUM(BA3:BF3)","v":0},{"$f":"SUMIFS(INDEX(BA:BA,11):INDEX(BA:BA,100000),INDEX($F:$F,11):INDEX($F:$F,100000),$P3,INDEX($J:$J,11):INDEX($J:$J,100000),\"0_AttentionNeeded\")\n+SUMIFS(INDEX(BA:BA,11):INDEX(BA:BA,100000),INDEX($F:$F,11):INDEX($F:$F,100000),$P3,INDEX($J:$J,11):INDEX($J:$J,100000),\"1_Assigned\")\n+SUMIFS(INDEX(BA:BA,11):INDEX(BA:BA,100000),INDEX($F:$F,11):INDEX($F:$F,100000),$P3,INDEX($J:$J,11):INDEX($J:$J,100000),\"2_InProgress\")\n+SUMIFS(INDEX(BA:BA,11):INDEX(BA:BA,100000),INDEX($F:$F,11):INDEX($F:$F,100000),$P3,INDEX($J:$J,11):INDEX($J:$J,100000),\"3_Prototype\")\n+SUMIFS(INDEX(BA:BA,11):INDEX(BA:BA,100000),INDEX($F:$F,11):INDEX($F:$F,100000),$P3,INDEX($J:$J,11):INDEX($J:$J,100000),\"4_Testing\")","v":0},{"$f":"SUMIFS(INDEX(BB:BB,11):INDEX(BB:BB,100000),INDEX($F:$F,11):INDEX($F:$F,100000),$P3,INDEX($J:$J,11):INDEX($J:$J,100000),\"0_AttentionNeeded\")\n+SUMIFS(INDEX(BB:BB,11):INDEX(BB:BB,100000),INDEX($F:$F,11):INDEX($F:$F,100000),$P3,INDEX($J:$J,11):INDEX($J:$J,100000),\"1_Assigned\")\n+SUMIFS(INDEX(BB:BB,11):INDEX(BB:BB,100000),INDEX($F:$F,11):INDEX($F:$F,100000),$P3,INDEX($J:$J,11):INDEX($J:$J,100000),\"2_InProgress\")\n+SUMIFS(INDEX(BB:BB,11):INDEX(BB:BB,100000),INDEX($F:$F,11):INDEX($F:$F,100000),$P3,INDEX($J:$J,11):INDEX($J:$J,100000),\"3_Prototype\")\n+SUMIFS(INDEX(BB:BB,11):INDEX(BB:BB,100000),INDEX($F:$F,11):INDEX($F:$F,100000),$P3,INDEX($J:$J,11):INDEX($J:$J,100000),\"4_Testing\")","v":0},{"$f":"SUMIFS(INDEX(BC:BC,11):INDEX(BC:BC,100000),INDEX($F:$F,11):INDEX($F:$F,100000),$P3,INDEX($J:$J,11):INDEX($J:$J,100000),\"0_AttentionNeeded\")\n+SUMIFS(INDEX(BC:BC,11):INDEX(BC:BC,100000),INDEX($F:$F,11):INDEX($F:$F,100000),$P3,INDEX($J:$J,11):INDEX($J:$J,100000),\"1_Assigned\")\n+SUMIFS(INDEX(BC:BC,11):INDEX(BC:BC,100000),INDEX($F:$F,11):INDEX($F:$F,100000),$P3,INDEX($J:$J,11):INDEX($J:$J,100000),\"2_InProgress\")\n+SUMIFS(INDEX(BC:BC,11):INDEX(BC:BC,100000),INDEX($F:$F,11):INDEX($F:$F,100000),$P3,INDEX($J:$J,11):INDEX($J:$J,100000),\"3_Prototype\")\n+SUMIFS(INDEX(BC:BC,11):INDEX(BC:BC,100000),INDEX($F:$F,11):INDEX($F:$F,100000),$P3,INDEX($J:$J,11):INDEX($J:$J,100000),\"4_Testing\")","v":0},{"$f":"SUMIFS(INDEX(BD:BD,11):INDEX(BD:BD,100000),INDEX($F:$F,11):INDEX($F:$F,100000),$P3,INDEX($J:$J,11):INDEX($J:$J,100000),\"0_AttentionNeeded\")\n+SUMIFS(INDEX(BD:BD,11):INDEX(BD:BD,100000),INDEX($F:$F,11):INDEX($F:$F,100000),$P3,INDEX($J:$J,11):INDEX($J:$J,100000),\"1_Assigned\")\n+SUMIFS(INDEX(BD:BD,11):INDEX(BD:BD,100000),INDEX($F:$F,11):INDEX($F:$F,100000),$P3,INDEX($J:$J,11):INDEX($J:$J,100000),\"2_InProgress\")\n+SUMIFS(INDEX(BD:BD,11):INDEX(BD:BD,100000),INDEX($F:$F,11):INDEX($F:$F,100000),$P3,INDEX($J:$J,11):INDEX($J:$J,100000),\"3_Prototype\")\n+SUMIFS(INDEX(BD:BD,11):INDEX(BD:BD,100000),INDEX($F:$F,11):INDEX($F:$F,100000),$P3,INDEX($J:$J,11):INDEX($J:$J,100000),\"4_Testing\")","v":0},{"$f":"SUMIFS(INDEX(BE:BE,11):INDEX(BE:BE,100000),INDEX($F:$F,11):INDEX($F:$F,100000),$P3,INDEX($J:$J,11):INDEX($J:$J,100000),\"0_AttentionNeeded\")\n+SUMIFS(INDEX(BE:BE,11):INDEX(BE:BE,100000),INDEX($F:$F,11):INDEX($F:$F,100000),$P3,INDEX($J:$J,11):INDEX($J:$J,100000),\"1_Assigned\")\n+SUMIFS(INDEX(BE:BE,11):INDEX(BE:BE,100000),INDEX($F:$F,11):INDEX($F:$F,100000),$P3,INDEX($J:$J,11):INDEX($J:$J,100000),\"2_InProgress\")\n+SUMIFS(INDEX(BE:BE,11):INDEX(BE:BE,100000),INDEX($F:$F,11):INDEX($F:$F,100000),$P3,INDEX($J:$J,11):INDEX($J:$J,100000),\"3_Prototype\")\n+SUMIFS(INDEX(BE:BE,11):INDEX(BE:BE,100000),INDEX($F:$F,11):INDEX($F:$F,100000),$P3,INDEX($J:$J,11):INDEX($J:$J,100000),\"4_Testing\")","v":0},{"$f":"SUMIFS(INDEX(BF:BF,11):INDEX(BF:BF,100000),INDEX($F:$F,11):INDEX($F:$F,100000),$P3,INDEX($J:$J,11):INDEX($J:$J,100000),\"0_AttentionNeeded\")\n+SUMIFS(INDEX(BF:BF,11):INDEX(BF:BF,100000),INDEX($F:$F,11):INDEX($F:$F,100000),$P3,INDEX($J:$J,11):INDEX($J:$J,100000),\"1_Assigned\")\n+SUMIFS(INDEX(BF:BF,11):INDEX(BF:BF,100000),INDEX($F:$F,11):INDEX($F:$F,100000),$P3,INDEX($J:$J,11):INDEX($J:$J,100000),\"2_InProgress\")\n+SUMIFS(INDEX(BF:BF,11):INDEX(BF:BF,100000),INDEX($F:$F,11):INDEX($F:$F,100000),$P3,INDEX($J:$J,11):INDEX($J:$J,100000),\"3_Prototype\")\n+SUMIFS(INDEX(BF:BF,11):INDEX(BF:BF,100000),INDEX($F:$F,11):INDEX($F:$F,100000),$P3,INDEX($J:$J,11):INDEX($J:$J,100000),\"4_Testing\")","v":0}]
[null,null,null,null,null,null,null,null,null,null,null,null,null,null,null,"N1",0,{"$f":"SUMIFS(INDEX(R:R,11):INDEX(R:R,100000),INDEX($F:$F,11):INDEX($F:$F,100000),$P4,INDEX($J:$J,11):INDEX($J:$J,100000),\"0_AttentionNeeded\")\n+SUMIFS(INDEX(R:R,11):INDEX(R:R,100000),INDEX($F:$F,11):INDEX($F:$F,100000),$P4,INDEX($J:$J,11):INDEX($J:$J,100000),\"1_Assigned\")\n+SUMIFS(INDEX(R:R,11):INDEX(R:R,100000),INDEX($F:$F,11):INDEX($F:$F,100000),$P4,INDEX($J:$J,11):INDEX($J:$J,100000),\"2_InProgress\")\n+SUMIFS(INDEX(R:R,11):INDEX(R:R,100000),INDEX($F:$F,11):INDEX($F:$F,100000),$P4,INDEX($J:$J,11):INDEX($J:$J,100000),\"3_Prototype\")\n+SUMIFS(INDEX(R:R,11):INDEX(R:R,100000),INDEX($F:$F,11):INDEX($F:$F,100000),$P4,INDEX($J:$J,11):INDEX($J:$J,100000),\"4_Testing\")","v":0},{"$f":"SUMIFS(INDEX(S:S,11):INDEX(S:S,100000),INDEX($F:$F,11):INDEX($F:$F,100000),$P4,INDEX($J:$J,11):INDEX($J:$J,100000),\"0_AttentionNeeded\")\n+SUMIFS(INDEX(S:S,11):INDEX(S:S,100000),INDEX($F:$F,11):INDEX($F:$F,100000),$P4,INDEX($J:$J,11):INDEX($J:$J,100000),\"1_Assigned\")\n+SUMIFS(INDEX(S:S,11):INDEX(S:S,100000),INDEX($F:$F,11):INDEX($F:$F,100000),$P4,INDEX($J:$J,11):INDEX($J:$J,100000),\"2_InProgress\")\n+SUMIFS(INDEX(S:S,11):INDEX(S:S,100000),INDEX($F:$F,11):INDEX($F:$F,100000),$P4,INDEX($J:$J,11):INDEX($J:$J,100000),\"3_Prototype\")\n+SUMIFS(INDEX(S:S,11):INDEX(S:S,100000),INDEX($F:$F,11):INDEX($F:$F,100000),$P4,INDEX($J:$J,11):INDEX($J:$J,100000),\"4_Testing\")","v":0},{"$f":"SUMIFS(INDEX(T:T,11):INDEX(T:T,100000),INDEX($F:$F,11):INDEX($F:$F,100000),$P4,INDEX($J:$J,11):INDEX($J:$J,100000),\"0_AttentionNeeded\")\n+SUMIFS(INDEX(T:T,11):INDEX(T:T,100000),INDEX($F:$F,11):INDEX($F:$F,100000),$P4,INDEX($J:$J,11):INDEX($J:$J,100000),\"1_Assigned\")\n+SUMIFS(INDEX(T:T,11):INDEX(T:T,100000),INDEX($F:$F,11):INDEX($F:$F,100000),$P4,INDEX($J:$J,11):INDEX($J:$J,100000),\"2_InProgress\")\n+SUMIFS(INDEX(T:T,11):INDEX(T:T,100000),INDEX($F:$F,11):INDEX($F:$F,100000),$P4,INDEX($J:$J,11):INDEX($J:$J,100000),\"3_Prototype\")\n+SUMIFS(INDEX(T:T,11):INDEX(T:T,100000),INDEX($F:$F,11):INDEX($F:$F,100000),$P4,INDEX($J:$J,11):INDEX($J:$J,100000),\"4_Testing\")","v":0},{"$f":"SUMIFS(INDEX(U:U,11):INDEX(U:U,100000),INDEX($F:$F,11):INDEX($F:$F,100000),$P4,INDEX($J:$J,11):INDEX($J:$J,100000),\"0_AttentionNeeded\")\n+SUMIFS(INDEX(U:U,11):INDEX(U:U,100000),INDEX($F:$F,11):INDEX($F:$F,100000),$P4,INDEX($J:$J,11):INDEX($J:$J,100000),\"1_Assigned\")\n+SUMIFS(INDEX(U:U,11):INDEX(U:U,100000),INDEX($F:$F,11):INDEX($F:$F,100000),$P4,INDEX($J:$J,11):INDEX($J:$J,100000),\"2_InProgress\")\n+SUMIFS(INDEX(U:U,11):INDEX(U:U,100000),INDEX($F:$F,11):INDEX($F:$F,100000),$P4,INDEX($J:$J,11):INDEX($J:$J,100000),\"3_Prototype\")\n+SUMIFS(INDEX(U:U,11):INDEX(U:U,100000),INDEX($F:$F,11):INDEX($F:$F,100000),$P4,INDEX($J:$J,11):INDEX($J:$J,100000),\"4_Testing\")","v":0},{"$f":"SUMIFS(INDEX(V:V,11):INDEX(V:V,100000),INDEX($F:$F,11):INDEX($F:$F,100000),$P4,INDEX($J:$J,11):INDEX($J:$J,100000),\"0_AttentionNeeded\")\n+SUMIFS(INDEX(V:V,11):INDEX(V:V,100000),INDEX($F:$F,11):INDEX($F:$F,100000),$P4,INDEX($J:$J,11):INDEX($J:$J,100000),\"1_Assigned\")\n+SUMIFS(INDEX(V:V,11):INDEX(V:V,100000),INDEX($F:$F,11):INDEX($F:$F,100000),$P4,INDEX($J:$J,11):INDEX($J:$J,100000),\"2_InProgress\")\n+SUMIFS(INDEX(V:V,11):INDEX(V:V,100000),INDEX($F:$F,11):INDEX($F:$F,100000),$P4,INDEX($J:$J,11):INDEX($J:$J,100000),\"3_Prototype\")\n+SUMIFS(INDEX(V:V,11):INDEX(V:V,100000),INDEX($F:$F,11):INDEX($F:$F,100000),$P4,INDEX($J:$J,11):INDEX($J:$J,100000),\"4_Testing\")","v":0},{"$f":"SUMIFS(INDEX(W:W,11):INDEX(W:W,100000),INDEX($F:$F,11):INDEX($F:$F,100000),$P4,INDEX($J:$J,11):INDEX($J:$J,100000),\"0_AttentionNeeded\")\n+SUMIFS(INDEX(W:W,11):INDEX(W:W,100000),INDEX($F:$F,11):INDEX($F:$F,100000),$P4,INDEX($J:$J,11):INDEX($J:$J,100000),\"1_Assigned\")\n+SUMIFS(INDEX(W:W,11):INDEX(W:W,100000),INDEX($F:$F,11):INDEX($F:$F,100000),$P4,INDEX($J:$J,11):INDEX($J:$J,100000),\"2_InProgress\")\n+SUMIFS(INDEX(W:W,11):INDEX(W:W,100000),INDEX($F:$F,11):INDEX($F:$F,100000),$P4,INDEX($J:$J,11):INDEX($J:$J,100000),\"3_Prototype\")\n+SUMIFS(INDEX(W:W,11):INDEX(W:W,100000),INDEX($F:$F,11):INDEX($F:$F,100000),$P4,INDEX($J:$J,11):INDEX($J:$J,100000),\"4_Testing\")","v":0},0,{"$f":"SUMIFS(INDEX(Y:Y,11):INDEX(Y:Y,100000),INDEX($F:$F,11):INDEX($F:$F,100000),$P4,INDEX($J:$J,11):INDEX($J:$J,100000),\"0_AttentionNeeded\")\n+SUMIFS(INDEX(Y:Y,11):INDEX(Y:Y,100000),INDEX($F:$F,11):INDEX($F:$F,100000),$P4,INDEX($J:$J,11):INDEX($J:$J,100000),\"1_Assigned\")\n+SUMIFS(INDEX(Y:Y,11):INDEX(Y:Y,100000),INDEX($F:$F,11):INDEX($F:$F,100000),$P4,INDEX($J:$J,11):INDEX($J:$J,100000),\"2_InProgress\")\n+SUMIFS(INDEX(Y:Y,11):INDEX(Y:Y,100000),INDEX($F:$F,11):INDEX($F:$F,100000),$P4,INDEX($J:$J,11):INDEX($J:$J,100000),\"3_Prototype\")\n+SUMIFS(INDEX(Y:Y,11):INDEX(Y:Y,100000),INDEX($F:$F,11):INDEX($F:$F,100000),$P4,INDEX($J:$J,11):INDEX($J:$J,100000),\"4_Testing\")","v":0},{"$f":"SUMIFS(INDEX(Z:Z,11):INDEX(Z:Z,100000),INDEX($F:$F,11):INDEX($F:$F,100000),$P4,INDEX($J:$J,11):INDEX($J:$J,100000),\"0_AttentionNeeded\")\n+SUMIFS(INDEX(Z:Z,11):INDEX(Z:Z,100000),INDEX($F:$F,11):INDEX($F:$F,100000),$P4,INDEX($J:$J,11):INDEX($J:$J,100000),\"1_Assigned\")\n+SUMIFS(INDEX(Z:Z,11):INDEX(Z:Z,100000),INDEX($F:$F,11):INDEX($F:$F,100000),$P4,INDEX($J:$J,11):INDEX($J:$J,100000),\"2_InProgress\")\n+SUMIFS(INDEX(Z:Z,11):INDEX(Z:Z,100000),INDEX($F:$F,11):INDEX($F:$F,100000),$P4,INDEX($J:$J,11):INDEX($J:$J,100000),\"3_Prototype\")\n+SUMIFS(INDEX(Z:Z,11):INDEX(Z:Z,100000),INDEX($F:$F,11):INDEX($F:$F,100000),$P4,INDEX($J:$J,11):INDEX($J:$J,100000),\"4_Testing\")","v":0},{"$f":"SUMIFS(INDEX(AA:AA,11):INDEX(AA:AA,100000),INDEX($F:$F,11):INDEX($F:$F,100000),$P4,INDEX($J:$J,11):INDEX($J:$J,100000),\"0_AttentionNeeded\")\n+SUMIFS(INDEX(AA:AA,11):INDEX(AA:AA,100000),INDEX($F:$F,11):INDEX($F:$F,100000),$P4,INDEX($J:$J,11):INDEX($J:$J,100000),\"1_Assigned\")\n+SUMIFS(INDEX(AA:AA,11):INDEX(AA:AA,100000),INDEX($F:$F,11):INDEX($F:$F,100000),$P4,INDEX($J:$J,11):INDEX($J:$J,100000),\"2_InProgress\")\n+SUMIFS(INDEX(AA:AA,11):INDEX(AA:AA,100000),INDEX($F:$F,11):INDEX($F:$F,100000),$P4,INDEX($J:$J,11):INDEX($J:$J,100000),\"3_Prototype\")\n+SUMIFS(INDEX(AA:AA,11):INDEX(AA:AA,100000),INDEX($F:$F,11):INDEX($F:$F,100000),$P4,INDEX($J:$J,11):INDEX($J:$J,100000),\"4_Testing\")","v":0},{"$f":"SUMIFS(INDEX(AB:AB,11):INDEX(AB:AB,100000),INDEX($F:$F,11):INDEX($F:$F,100000),$P4,INDEX($J:$J,11):INDEX($J:$J,100000),\"0_AttentionNeeded\")\n+SUMIFS(INDEX(AB:AB,11):INDEX(AB:AB,100000),INDEX($F:$F,11):INDEX($F:$F,100000),$P4,INDEX($J:$J,11):INDEX($J:$J,100000),\"1_Assigned\")\n+SUMIFS(INDEX(AB:AB,11):INDEX(AB:AB,100000),INDEX($F:$F,11):INDEX($F:$F,100000),$P4,INDEX($J:$J,11):INDEX($J:$J,100000),\"2_InProgress\")\n+SUMIFS(INDEX(AB:AB,11):INDEX(AB:AB,100000),INDEX($F:$F,11):INDEX($F:$F,100000),$P4,INDEX($J:$J,11):INDEX($J:$J,100000),\"3_Prototype\")\n+SUMIFS(INDEX(AB:AB,11):INDEX(AB:AB,100000),INDEX($F:$F,11):INDEX($F:$F,100000),$P4,INDEX($J:$J,11):INDEX($J:$J,100000),\"4_Testing\")","v":0},{"$f":"SUMIFS(INDEX(AC:AC,11):INDEX(AC:AC,100000),INDEX($F:$F,11):INDEX($F:$F,100000),$P4,INDEX($J:$J,11):INDEX($J:$J,100000),\"0_AttentionNeeded\")\n+SUMIFS(INDEX(AC:AC,11):INDEX(AC:AC,100000),INDEX($F:$F,11):INDEX($F:$F,100000),$P4,INDEX($J:$J,11):INDEX($J:$J,100000),\"1_Assigned\")\n+SUMIFS(INDEX(AC:AC,11):INDEX(AC:AC,100000),INDEX($F:$F,11):INDEX($F:$F,100000),$P4,INDEX($J:$J,11):INDEX($J:$J,100000),\"2_InProgress\")\n+SUMIFS(INDEX(AC:AC,11):INDEX(AC:AC,100000),INDEX($F:$F,11):INDEX($F:$F,100000),$P4,INDEX($J:$J,11):INDEX($J:$J,100000),\"3_Prototype\")\n+SUMIFS(INDEX(AC:AC,11):INDEX(AC:AC,100000),INDEX($F:$F,11):INDEX($F:$F,100000),$P4,INDEX($J:$J,11):INDEX($J:$J,100000),\"4_Testing\")","v":0},{"$f":"SUMIFS(INDEX(AD:AD,11):INDEX(AD:AD,100000),INDEX($F:$F,11):INDEX($F:$F,100000),$P4,INDEX($J:$J,11):INDEX($J:$J,100000),\"0_AttentionNeeded\")\n+SUMIFS(INDEX(AD:AD,11):INDEX(AD:AD,100000),INDEX($F:$F,11):INDEX($F:$F,100000),$P4,INDEX($J:$J,11):INDEX($J:$J,100000),\"1_Assigned\")\n+SUMIFS(INDEX(AD:AD,11):INDEX(AD:AD,100000),INDEX($F:$F,11):INDEX($F:$F,100000),$P4,INDEX($J:$J,11):INDEX($J:$J,100000),\"2_InProgress\")\n+SUMIFS(INDEX(AD:AD,11):INDEX(AD:AD,100000),INDEX($F:$F,11):INDEX($F:$F,100000),$P4,INDEX($J:$J,11):INDEX($J:$J,100000),\"3_Prototype\")\n+SUMIFS(INDEX(AD:AD,11):INDEX(AD:AD,100000),INDEX($F:$F,11):INDEX($F:$F,100000),$P4,INDEX($J:$J,11):INDEX($J:$J,100000),\"4_Testing\")","v":0},0,{"$f":"SUMIFS(INDEX(AF:AF,11):INDEX(AF:AF,100000),INDEX($F:$F,11):INDEX($F:$F,100000),$P4,INDEX($J:$J,11):INDEX($J:$J,100000),\"0_AttentionNeeded\")\n+SUMIFS(INDEX(AF:AF,11):INDEX(AF:AF,100000),INDEX($F:$F,11):INDEX($F:$F,100000),$P4,INDEX($J:$J,11):INDEX($J:$J,100000),\"1_Assigned\")\n+SUMIFS(INDEX(AF:AF,11):INDEX(AF:AF,100000),INDEX($F:$F,11):INDEX($F:$F,100000),$P4,INDEX($J:$J,11):INDEX($J:$J,100000),\"2_InProgress\")\n+SUMIFS(INDEX(AF:AF,11):INDEX(AF:AF,100000),INDEX($F:$F,11):INDEX($F:$F,100000),$P4,INDEX($J:$J,11):INDEX($J:$J,100000),\"3_Prototype\")\n+SUMIFS(INDEX(AF:AF,11):INDEX(AF:AF,100000),INDEX($F:$F,11):INDEX($F:$F,100000),$P4,INDEX($J:$J,11):INDEX($J:$J,100000),\"4_Testing\")","v":0},{"$f":"SUMIFS(INDEX(AG:AG,11):INDEX(AG:AG,100000),INDEX($F:$F,11):INDEX($F:$F,100000),$P4,INDEX($J:$J,11):INDEX($J:$J,100000),\"0_AttentionNeeded\")\n+SUMIFS(INDEX(AG:AG,11):INDEX(AG:AG,100000),INDEX($F:$F,11):INDEX($F:$F,100000),$P4,INDEX($J:$J,11):INDEX($J:$J,100000),\"1_Assigned\")\n+SUMIFS(INDEX(AG:AG,11):INDEX(AG:AG,100000),INDEX($F:$F,11):INDEX($F:$F,100000),$P4,INDEX($J:$J,11):INDEX($J:$J,100000),\"2_InProgress\")\n+SUMIFS(INDEX(AG:AG,11):INDEX(AG:AG,100000),INDEX($F:$F,11):INDEX($F:$F,100000),$P4,INDEX($J:$J,11):INDEX($J:$J,100000),\"3_Prototype\")\n+SUMIFS(INDEX(AG:AG,11):INDEX(AG:AG,100000),INDEX($F:$F,11):INDEX($F:$F,100000),$P4,INDEX($J:$J,11):INDEX($J:$J,100000),\"4_Testing\")","v":0},{"$f":"SUMIFS(INDEX(AH:AH,11):INDEX(AH:AH,100000),INDEX($F:$F,11):INDEX($F:$F,100000),$P4,INDEX($J:$J,11):INDEX($J:$J,100000),\"0_AttentionNeeded\")\n+SUMIFS(INDEX(AH:AH,11):INDEX(AH:AH,100000),INDEX($F:$F,11):INDEX($F:$F,100000),$P4,INDEX($J:$J,11):INDEX($J:$J,100000),\"1_Assigned\")\n+SUMIFS(INDEX(AH:AH,11):INDEX(AH:AH,100000),INDEX($F:$F,11):INDEX($F:$F,100000),$P4,INDEX($J:$J,11):INDEX($J:$J,100000),\"2_InProgress\")\n+SUMIFS(INDEX(AH:AH,11):INDEX(AH:AH,100000),INDEX($F:$F,11):INDEX($F:$F,100000),$P4,INDEX($J:$J,11):INDEX($J:$J,100000),\"3_Prototype\")\n+SUMIFS(INDEX(AH:AH,11):INDEX(AH:AH,100000),INDEX($F:$F,11):INDEX($F:$F,100000),$P4,INDEX($J:$J,11):INDEX($J:$J,100000),\"4_Testing\")","v":0},{"$f":"SUMIFS(INDEX(AI:AI,11):INDEX(AI:AI,100000),INDEX($F:$F,11):INDEX($F:$F,100000),$P4,INDEX($J:$J,11):INDEX($J:$J,100000),\"0_AttentionNeeded\")\n+SUMIFS(INDEX(AI:AI,11):INDEX(AI:AI,100000),INDEX($F:$F,11):INDEX($F:$F,100000),$P4,INDEX($J:$J,11):INDEX($J:$J,100000),\"1_Assigned\")\n+SUMIFS(INDEX(AI:AI,11):INDEX(AI:AI,100000),INDEX($F:$F,11):INDEX($F:$F,100000),$P4,INDEX($J:$J,11):INDEX($J:$J,100000),\"2_InProgress\")\n+SUMIFS(INDEX(AI:AI,11):INDEX(AI:AI,100000),INDEX($F:$F,11):INDEX($F:$F,100000),$P4,INDEX($J:$J,11):INDEX($J:$J,100000),\"3_Prototype\")\n+SUMIFS(INDEX(AI:AI,11):INDEX(AI:AI,100000),INDEX($F:$F,11):INDEX($F:$F,100000),$P4,INDEX($J:$J,11):INDEX($J:$J,100000),\"4_Testing\")","v":0},{"$f":"SUMIFS(INDEX(AJ:AJ,11):INDEX(AJ:AJ,100000),INDEX($F:$F,11):INDEX($F:$F,100000),$P4,INDEX($J:$J,11):INDEX($J:$J,100000),\"0_AttentionNeeded\")\n+SUMIFS(INDEX(AJ:AJ,11):INDEX(AJ:AJ,100000),INDEX($F:$F,11):INDEX($F:$F,100000),$P4,INDEX($J:$J,11):INDEX($J:$J,100000),\"1_Assigned\")\n+SUMIFS(INDEX(AJ:AJ,11):INDEX(AJ:AJ,100000),INDEX($F:$F,11):INDEX($F:$F,100000),$P4,INDEX($J:$J,11):INDEX($J:$J,100000),\"2_InProgress\")\n+SUMIFS(INDEX(AJ:AJ,11):INDEX(AJ:AJ,100000),INDEX($F:$F,11):INDEX($F:$F,100000),$P4,INDEX($J:$J,11):INDEX($J:$J,100000),\"3_Prototype\")\n+SUMIFS(INDEX(AJ:AJ,11):INDEX(AJ:AJ,100000),INDEX($F:$F,11):INDEX($F:$F,100000),$P4,INDEX($J:$J,11):INDEX($J:$J,100000),\"4_Testing\")","v":0},{"$f":"SUMIFS(INDEX(AK:AK,11):INDEX(AK:AK,100000),INDEX($F:$F,11):INDEX($F:$F,100000),$P4,INDEX($J:$J,11):INDEX($J:$J,100000),\"0_AttentionNeeded\")\n+SUMIFS(INDEX(AK:AK,11):INDEX(AK:AK,100000),INDEX($F:$F,11):INDEX($F:$F,100000),$P4,INDEX($J:$J,11):INDEX($J:$J,100000),\"1_Assigned\")\n+SUMIFS(INDEX(AK:AK,11):INDEX(AK:AK,100000),INDEX($F:$F,11):INDEX($F:$F,100000),$P4,INDEX($J:$J,11):INDEX($J:$J,100000),\"2_InProgress\")\n+SUMIFS(INDEX(AK:AK,11):INDEX(AK:AK,100000),INDEX($F:$F,11):INDEX($F:$F,100000),$P4,INDEX($J:$J,11):INDEX($J:$J,100000),\"3_Prototype\")\n+SUMIFS(INDEX(AK:AK,11):INDEX(AK:AK,100000),INDEX($F:$F,11):INDEX($F:$F,100000),$P4,INDEX($J:$J,11):INDEX($J:$J,100000),\"4_Testing\")","v":0},0,{"$f":"SUMIFS(INDEX(AM:AM,11):INDEX(AM:AM,100000),INDEX($F:$F,11):INDEX($F:$F,100000),$P4,INDEX($J:$J,11):INDEX($J:$J,100000),\"0_AttentionNeeded\")\n+SUMIFS(INDEX(AM:AM,11):INDEX(AM:AM,100000),INDEX($F:$F,11):INDEX($F:$F,100000),$P4,INDEX($J:$J,11):INDEX($J:$J,100000),\"1_Assigned\")\n+SUMIFS(INDEX(AM:AM,11):INDEX(AM:AM,100000),INDEX($F:$F,11):INDEX($F:$F,100000),$P4,INDEX($J:$J,11):INDEX($J:$J,100000),\"2_InProgress\")\n+SUMIFS(INDEX(AM:AM,11):INDEX(AM:AM,100000),INDEX($F:$F,11):INDEX($F:$F,100000),$P4,INDEX($J:$J,11):INDEX($J:$J,100000),\"3_Prototype\")\n+SUMIFS(INDEX(AM:AM,11):INDEX(AM:AM,100000),INDEX($F:$F,11):INDEX($F:$F,100000),$P4,INDEX($J:$J,11):INDEX($J:$J,100000),\"4_Testing\")","v":0},{"$f":"SUMIFS(INDEX(AN:AN,11):INDEX(AN:AN,100000),INDEX($F:$F,11):INDEX($F:$F,100000),$P4,INDEX($J:$J,11):INDEX($J:$J,100000),\"0_AttentionNeeded\")\n+SUMIFS(INDEX(AN:AN,11):INDEX(AN:AN,100000),INDEX($F:$F,11):INDEX($F:$F,100000),$P4,INDEX($J:$J,11):INDEX($J:$J,100000),\"1_Assigned\")\n+SUMIFS(INDEX(AN:AN,11):INDEX(AN:AN,100000),INDEX($F:$F,11):INDEX($F:$F,100000),$P4,INDEX($J:$J,11):INDEX($J:$J,100000),\"2_InProgress\")\n+SUMIFS(INDEX(AN:AN,11):INDEX(AN:AN,100000),INDEX($F:$F,11):INDEX($F:$F,100000),$P4,INDEX($J:$J,11):INDEX($J:$J,100000),\"3_Prototype\")\n+SUMIFS(INDEX(AN:AN,11):INDEX(AN:AN,100000),INDEX($F:$F,11):INDEX($F:$F,100000),$P4,INDEX($J:$J,11):INDEX($J:$J,100000),\"4_Testing\")","v":0},{"$f":"SUMIFS(INDEX(AO:AO,11):INDEX(AO:AO,100000),INDEX($F:$F,11):INDEX($F:$F,100000),$P4,INDEX($J:$J,11):INDEX($J:$J,100000),\"0_AttentionNeeded\")\n+SUMIFS(INDEX(AO:AO,11):INDEX(AO:AO,100000),INDEX($F:$F,11):INDEX($F:$F,100000),$P4,INDEX($J:$J,11):INDEX($J:$J,100000),\"1_Assigned\")\n+SUMIFS(INDEX(AO:AO,11):INDEX(AO:AO,100000),INDEX($F:$F,11):INDEX($F:$F,100000),$P4,INDEX($J:$J,11):INDEX($J:$J,100000),\"2_InProgress\")\n+SUMIFS(INDEX(AO:AO,11):INDEX(AO:AO,100000),INDEX($F:$F,11):INDEX($F:$F,100000),$P4,INDEX($J:$J,11):INDEX($J:$J,100000),\"3_Prototype\")\n+SUMIFS(INDEX(AO:AO,11):INDEX(AO:AO,100000),INDEX($F:$F,11):INDEX($F:$F,100000),$P4,INDEX($J:$J,11):INDEX($J:$J,100000),\"4_Testing\")","v":0},{"$f":"SUMIFS(INDEX(AP:AP,11):INDEX(AP:AP,100000),INDEX($F:$F,11):INDEX($F:$F,100000),$P4,INDEX($J:$J,11):INDEX($J:$J,100000),\"0_AttentionNeeded\")\n+SUMIFS(INDEX(AP:AP,11):INDEX(AP:AP,100000),INDEX($F:$F,11):INDEX($F:$F,100000),$P4,INDEX($J:$J,11):INDEX($J:$J,100000),\"1_Assigned\")\n+SUMIFS(INDEX(AP:AP,11):INDEX(AP:AP,100000),INDEX($F:$F,11):INDEX($F:$F,100000),$P4,INDEX($J:$J,11):INDEX($J:$J,100000),\"2_InProgress\")\n+SUMIFS(INDEX(AP:AP,11):INDEX(AP:AP,100000),INDEX($F:$F,11):INDEX($F:$F,100000),$P4,INDEX($J:$J,11):INDEX($J:$J,100000),\"3_Prototype\")\n+SUMIFS(INDEX(AP:AP,11):INDEX(AP:AP,100000),INDEX($F:$F,11):INDEX($F:$F,100000),$P4,INDEX($J:$J,11):INDEX($J:$J,100000),\"4_Testing\")","v":0},{"$f":"SUMIFS(INDEX(AQ:AQ,11):INDEX(AQ:AQ,100000),INDEX($F:$F,11):INDEX($F:$F,100000),$P4,INDEX($J:$J,11):INDEX($J:$J,100000),\"0_AttentionNeeded\")\n+SUMIFS(INDEX(AQ:AQ,11):INDEX(AQ:AQ,100000),INDEX($F:$F,11):INDEX($F:$F,100000),$P4,INDEX($J:$J,11):INDEX($J:$J,100000),\"1_Assigned\")\n+SUMIFS(INDEX(AQ:AQ,11):INDEX(AQ:AQ,100000),INDEX($F:$F,11):INDEX($F:$F,100000),$P4,INDEX($J:$J,11):INDEX($J:$J,100000),\"2_InProgress\")\n+SUMIFS(INDEX(AQ:AQ,11):INDEX(AQ:AQ,100000),INDEX($F:$F,11):INDEX($F:$F,100000),$P4,INDEX($J:$J,11):INDEX($J:$J,100000),\"3_Prototype\")\n+SUMIFS(INDEX(AQ:AQ,11):INDEX(AQ:AQ,100000),INDEX($F:$F,11):INDEX($F:$F,100000),$P4,INDEX($J:$J,11):INDEX($J:$J,100000),\"4_Testing\")","v":0},{"$f":"SUMIFS(INDEX(AR:AR,11):INDEX(AR:AR,100000),INDEX($F:$F,11):INDEX($F:$F,100000),$P4,INDEX($J:$J,11):INDEX($J:$J,100000),\"0_AttentionNeeded\")\n+SUMIFS(INDEX(AR:AR,11):INDEX(AR:AR,100000),INDEX($F:$F,11):INDEX($F:$F,100000),$P4,INDEX($J:$J,11):INDEX($J:$J,100000),\"1_Assigned\")\n+SUMIFS(INDEX(AR:AR,11):INDEX(AR:AR,100000),INDEX($F:$F,11):INDEX($F:$F,100000),$P4,INDEX($J:$J,11):INDEX($J:$J,100000),\"2_InProgress\")\n+SUMIFS(INDEX(AR:AR,11):INDEX(AR:AR,100000),INDEX($F:$F,11):INDEX($F:$F,100000),$P4,INDEX($J:$J,11):INDEX($J:$J,100000),\"3_Prototype\")\n+SUMIFS(INDEX(AR:AR,11):INDEX(AR:AR,100000),INDEX($F:$F,11):INDEX($F:$F,100000),$P4,INDEX($J:$J,11):INDEX($J:$J,100000),\"4_Testing\")","v":0},0,{"$f":"SUMIFS(INDEX(AT:AT,11):INDEX(AT:AT,100000),INDEX($F:$F,11):INDEX($F:$F,100000),$P4,INDEX($J:$J,11):INDEX($J:$J,100000),\"0_AttentionNeeded\")\n+SUMIFS(INDEX(AT:AT,11):INDEX(AT:AT,100000),INDEX($F:$F,11):INDEX($F:$F,100000),$P4,INDEX($J:$J,11):INDEX($J:$J,100000),\"1_Assigned\")\n+SUMIFS(INDEX(AT:AT,11):INDEX(AT:AT,100000),INDEX($F:$F,11):INDEX($F:$F,100000),$P4,INDEX($J:$J,11):INDEX($J:$J,100000),\"2_InProgress\")\n+SUMIFS(INDEX(AT:AT,11):INDEX(AT:AT,100000),INDEX($F:$F,11):INDEX($F:$F,100000),$P4,INDEX($J:$J,11):INDEX($J:$J,100000),\"3_Prototype\")\n+SUMIFS(INDEX(AT:AT,11):INDEX(AT:AT,100000),INDEX($F:$F,11):INDEX($F:$F,100000),$P4,INDEX($J:$J,11):INDEX($J:$J,100000),\"4_Testing\")","v":0},{"$f":"SUMIFS(INDEX(AU:AU,11):INDEX(AU:AU,100000),INDEX($F:$F,11):INDEX($F:$F,100000),$P4,INDEX($J:$J,11):INDEX($J:$J,100000),\"0_AttentionNeeded\")\n+SUMIFS(INDEX(AU:AU,11):INDEX(AU:AU,100000),INDEX($F:$F,11):INDEX($F:$F,100000),$P4,INDEX($J:$J,11):INDEX($J:$J,100000),\"1_Assigned\")\n+SUMIFS(INDEX(AU:AU,11):INDEX(AU:AU,100000),INDEX($F:$F,11):INDEX($F:$F,100000),$P4,INDEX($J:$J,11):INDEX($J:$J,100000),\"2_InProgress\")\n+SUMIFS(INDEX(AU:AU,11):INDEX(AU:AU,100000),INDEX($F:$F,11):INDEX($F:$F,100000),$P4,INDEX($J:$J,11):INDEX($J:$J,100000),\"3_Prototype\")\n+SUMIFS(INDEX(AU:AU,11):INDEX(AU:AU,100000),INDEX($F:$F,11):INDEX($F:$F,100000),$P4,INDEX($J:$J,11):INDEX($J:$J,100000),\"4_Testing\")","v":0},{"$f":"SUMIFS(INDEX(AV:AV,11):INDEX(AV:AV,100000),INDEX($F:$F,11):INDEX($F:$F,100000),$P4,INDEX($J:$J,11):INDEX($J:$J,100000),\"0_AttentionNeeded\")\n+SUMIFS(INDEX(AV:AV,11):INDEX(AV:AV,100000),INDEX($F:$F,11):INDEX($F:$F,100000),$P4,INDEX($J:$J,11):INDEX($J:$J,100000),\"1_Assigned\")\n+SUMIFS(INDEX(AV:AV,11):INDEX(AV:AV,100000),INDEX($F:$F,11):INDEX($F:$F,100000),$P4,INDEX($J:$J,11):INDEX($J:$J,100000),\"2_InProgress\")\n+SUMIFS(INDEX(AV:AV,11):INDEX(AV:AV,100000),INDEX($F:$F,11):INDEX($F:$F,100000),$P4,INDEX($J:$J,11):INDEX($J:$J,100000),\"3_Prototype\")\n+SUMIFS(INDEX(AV:AV,11):INDEX(AV:AV,100000),INDEX($F:$F,11):INDEX($F:$F,100000),$P4,INDEX($J:$J,11):INDEX($J:$J,100000),\"4_Testing\")","v":0},{"$f":"SUMIFS(INDEX(AW:AW,11):INDEX(AW:AW,100000),INDEX($F:$F,11):INDEX($F:$F,100000),$P4,INDEX($J:$J,11):INDEX($J:$J,100000),\"0_AttentionNeeded\")\n+SUMIFS(INDEX(AW:AW,11):INDEX(AW:AW,100000),INDEX($F:$F,11):INDEX($F:$F,100000),$P4,INDEX($J:$J,11):INDEX($J:$J,100000),\"1_Assigned\")\n+SUMIFS(INDEX(AW:AW,11):INDEX(AW:AW,100000),INDEX($F:$F,11):INDEX($F:$F,100000),$P4,INDEX($J:$J,11):INDEX($J:$J,100000),\"2_InProgress\")\n+SUMIFS(INDEX(AW:AW,11):INDEX(AW:AW,100000),INDEX($F:$F,11):INDEX($F:$F,100000),$P4,INDEX($J:$J,11):INDEX($J:$J,100000),\"3_Prototype\")\n+SUMIFS(INDEX(AW:AW,11):INDEX(AW:AW,100000),INDEX($F:$F,11):INDEX($F:$F,100000),$P4,INDEX($J:$J,11):INDEX($J:$J,100000),\"4_Testing\")","v":0},{"$f":"SUMIFS(INDEX(AX:AX,11):INDEX(AX:AX,100000),INDEX($F:$F,11):INDEX($F:$F,100000),$P4,INDEX($J:$J,11):INDEX($J:$J,100000),\"0_AttentionNeeded\")\n+SUMIFS(INDEX(AX:AX,11):INDEX(AX:AX,100000),INDEX($F:$F,11):INDEX($F:$F,100000),$P4,INDEX($J:$J,11):INDEX($J:$J,100000),\"1_Assigned\")\n+SUMIFS(INDEX(AX:AX,11):INDEX(AX:AX,100000),INDEX($F:$F,11):INDEX($F:$F,100000),$P4,INDEX($J:$J,11):INDEX($J:$J,100000),\"2_InProgress\")\n+SUMIFS(INDEX(AX:AX,11):INDEX(AX:AX,100000),INDEX($F:$F,11):INDEX($F:$F,100000),$P4,INDEX($J:$J,11):INDEX($J:$J,100000),\"3_Prototype\")\n+SUMIFS(INDEX(AX:AX,11):INDEX(AX:AX,100000),INDEX($F:$F,11):INDEX($F:$F,100000),$P4,INDEX($J:$J,11):INDEX($J:$J,100000),\"4_Testing\")","v":0},{"$f":"SUMIFS(INDEX(AY:AY,11):INDEX(AY:AY,100000),INDEX($F:$F,11):INDEX($F:$F,100000),$P4,INDEX($J:$J,11):INDEX($J:$J,100000),\"0_AttentionNeeded\")\n+SUMIFS(INDEX(AY:AY,11):INDEX(AY:AY,100000),INDEX($F:$F,11):INDEX($F:$F,100000),$P4,INDEX($J:$J,11):INDEX($J:$J,100000),\"1_Assigned\")\n+SUMIFS(INDEX(AY:AY,11):INDEX(AY:AY,100000),INDEX($F:$F,11):INDEX($F:$F,100000),$P4,INDEX($J:$J,11):INDEX($J:$J,100000),\"2_InProgress\")\n+SUMIFS(INDEX(AY:AY,11):INDEX(AY:AY,100000),INDEX($F:$F,11):INDEX($F:$F,100000),$P4,INDEX($J:$J,11):INDEX($J:$J,100000),\"3_Prototype\")\n+SUMIFS(INDEX(AY:AY,11):INDEX(AY:AY,100000),INDEX($F:$F,11):INDEX($F:$F,100000),$P4,INDEX($J:$J,11):INDEX($J:$J,100000),\"4_Testing\")","v":0},0,{"$f":"SUMIFS(INDEX(BA:BA,11):INDEX(BA:BA,100000),INDEX($F:$F,11):INDEX($F:$F,100000),$P4,INDEX($J:$J,11):INDEX($J:$J,100000),\"0_AttentionNeeded\")\n+SUMIFS(INDEX(BA:BA,11):INDEX(BA:BA,100000),INDEX($F:$F,11):INDEX($F:$F,100000),$P4,INDEX($J:$J,11):INDEX($J:$J,100000),\"1_Assigned\")\n+SUMIFS(INDEX(BA:BA,11):INDEX(BA:BA,100000),INDEX($F:$F,11):INDEX($F:$F,100000),$P4,INDEX($J:$J,11):INDEX($J:$J,100000),\"2_InProgress\")\n+SUMIFS(INDEX(BA:BA,11):INDEX(BA:BA,100000),INDEX($F:$F,11):INDEX($F:$F,100000),$P4,INDEX($J:$J,11):INDEX($J:$J,100000),\"3_Prototype\")\n+SUMIFS(INDEX(BA:BA,11):INDEX(BA:BA,100000),INDEX($F:$F,11):INDEX($F:$F,100000),$P4,INDEX($J:$J,11):INDEX($J:$J,100000),\"4_Testing\")","v":0},{"$f":"SUMIFS(INDEX(BB:BB,11):INDEX(BB:BB,100000),INDEX($F:$F,11):INDEX($F:$F,100000),$P4,INDEX($J:$J,11):INDEX($J:$J,100000),\"0_AttentionNeeded\")\n+SUMIFS(INDEX(BB:BB,11):INDEX(BB:BB,100000),INDEX($F:$F,11):INDEX($F:$F,100000),$P4,INDEX($J:$J,11):INDEX($J:$J,100000),\"1_Assigned\")\n+SUMIFS(INDEX(BB:BB,11):INDEX(BB:BB,100000),INDEX($F:$F,11):INDEX($F:$F,100000),$P4,INDEX($J:$J,11):INDEX($J:$J,100000),\"2_InProgress\")\n+SUMIFS(INDEX(BB:BB,11):INDEX(BB:BB,100000),INDEX($F:$F,11):INDEX($F:$F,100000),$P4,INDEX($J:$J,11):INDEX($J:$J,100000),\"3_Prototype\")\n+SUMIFS(INDEX(BB:BB,11):INDEX(BB:BB,100000),INDEX($F:$F,11):INDEX($F:$F,100000),$P4,INDEX($J:$J,11):INDEX($J:$J,100000),\"4_Testing\")","v":0},{"$f":"SUMIFS(INDEX(BC:BC,11):INDEX(BC:BC,100000),INDEX($F:$F,11):INDEX($F:$F,100000),$P4,INDEX($J:$J,11):INDEX($J:$J,100000),\"0_AttentionNeeded\")\n+SUMIFS(INDEX(BC:BC,11):INDEX(BC:BC,100000),INDEX($F:$F,11):INDEX($F:$F,100000),$P4,INDEX($J:$J,11):INDEX($J:$J,100000),\"1_Assigned\")\n+SUMIFS(INDEX(BC:BC,11):INDEX(BC:BC,100000),INDEX($F:$F,11):INDEX($F:$F,100000),$P4,INDEX($J:$J,11):INDEX($J:$J,100000),\"2_InProgress\")\n+SUMIFS(INDEX(BC:BC,11):INDEX(BC:BC,100000),INDEX($F:$F,11):INDEX($F:$F,100000),$P4,INDEX($J:$J,11):INDEX($J:$J,100000),\"3_Prototype\")\n+SUMIFS(INDEX(BC:BC,11):INDEX(BC:BC,100000),INDEX($F:$F,11):INDEX($F:$F,100000),$P4,INDEX($J:$J,11):INDEX($J:$J,100000),\"4_Testing\")","v":0},{"$f":"SUMIFS(INDEX(BD:BD,11):INDEX(BD:BD,100000),INDEX($F:$F,11):INDEX($F:$F,100000),$P4,INDEX($J:$J,11):INDEX($J:$J,100000),\"0_AttentionNeeded\")\n+SUMIFS(INDEX(BD:BD,11):INDEX(BD:BD,100000),INDEX($F:$F,11):INDEX($F:$F,100000),$P4,INDEX($J:$J,11):INDEX($J:$J,100000),\"1_Assigned\")\n+SUMIFS(INDEX(BD:BD,11):INDEX(BD:BD,100000),INDEX($F:$F,11):INDEX($F:$F,100000),$P4,INDEX($J:$J,11):INDEX($J:$J,100000),\"2_InProgress\")\n+SUMIFS(INDEX(BD:BD,11):INDEX(BD:BD,100000),INDEX($F:$F,11):INDEX($F:$F,100000),$P4,INDEX($J:$J,11):INDEX($J:$J,100000),\"3_Prototype\")\n+SUMIFS(INDEX(BD:BD,11):INDEX(BD:BD,100000),INDEX($F:$F,11):INDEX($F:$F,100000),$P4,INDEX($J:$J,11):INDEX($J:$J,100000),\"4_Testing\")","v":0},{"$f":"SUMIFS(INDEX(BE:BE,11):INDEX(BE:BE,100000),INDEX($F:$F,11):INDEX($F:$F,100000),$P4,INDEX($J:$J,11):INDEX($J:$J,100000),\"0_AttentionNeeded\")\n+SUMIFS(INDEX(BE:BE,11):INDEX(BE:BE,100000),INDEX($F:$F,11):INDEX($F:$F,100000),$P4,INDEX($J:$J,11):INDEX($J:$J,100000),\"1_Assigned\")\n+SUMIFS(INDEX(BE:BE,11):INDEX(BE:BE,100000),INDEX($F:$F,11):INDEX($F:$F,100000),$P4,INDEX($J:$J,11):INDEX($J:$J,100000),\"2_InProgress\")\n+SUMIFS(INDEX(BE:BE,11):INDEX(BE:BE,100000),INDEX($F:$F,11):INDEX($F:$F,100000),$P4,INDEX($J:$J,11):INDEX($J:$J,100000),\"3_Prototype\")\n+SUMIFS(INDEX(BE:BE,11):INDEX(BE:BE,100000),INDEX($F:$F,11):INDEX($F:$F,100000),$P4,INDEX($J:$J,11):INDEX($J:$J,100000),\"4_Testing\")","v":0},{"$f":"SUMIFS(INDEX(BF:BF,11):INDEX(BF:BF,100000),INDEX($F:$F,11):INDEX($F:$F,100000),$P4,INDEX($J:$J,11):INDEX($J:$J,100000),\"0_AttentionNeeded\")\n+SUMIFS(INDEX(BF:BF,11):INDEX(BF:BF,100000),INDEX($F:$F,11):INDEX($F:$F,100000),$P4,INDEX($J:$J,11):INDEX($J:$J,100000),\"1_Assigned\")\n+SUMIFS(INDEX(BF:BF,11):INDEX(BF:BF,100000),INDEX($F:$F,11):INDEX($F:$F,100000),$P4,INDEX($J:$J,11):INDEX($J:$J,100000),\"2_InProgress\")\n+SUMIFS(INDEX(BF:BF,11):INDEX(BF:BF,100000),INDEX($F:$F,11):INDEX($F:$F,100000),$P4,INDEX($J:$J,11):INDEX($J:$J,100000),\"3_Prototype\")\n+SUMIFS(INDEX(BF:BF,11):INDEX(BF:BF,100000),INDEX($F:$F,11):INDEX($F:$F,100000),$P4,INDEX($J:$J,11):INDEX($J:$J,100000),\"4_Testing\")","v":0}]
[null,null,null,null,null,null,null,null,null,null,null,null,null,null,null,"N2",0,{"$f":"SUMIFS(INDEX(R:R,11):INDEX(R:R,100000),INDEX($F:$F,11):INDEX($F:$F,100000),$P5,INDEX($J:$J,11):INDEX($J:$J,100000),\"0_AttentionNeeded\")\n+SUMIFS(INDEX(R:R,11):INDEX(R:R,100000),INDEX($F:$F,11):INDEX($F:$F,100000),$P5,INDEX($J:$J,11):INDEX($J:$J,100000),\"1_Assigned\")\n+SUMIFS(INDEX(R:R,11):INDEX(R:R,100000),INDEX($F:$F,11):INDEX($F:$F,100000),$P5,INDEX($J:$J,11):INDEX($J:$J,100000),\"2_InProgress\")\n+SUMIFS(INDEX(R:R,11):INDEX(R:R,100000),INDEX($F:$F,11):INDEX($F:$F,100000),$P5,INDEX($J:$J,11):INDEX($J:$J,100000),\"3_Prototype\")\n+SUMIFS(INDEX(R:R,11):INDEX(R:R,100000),INDEX($F:$F,11):INDEX($F:$F,100000),$P5,INDEX($J:$J,11):INDEX($J:$J,100000),\"4_Testing\")","v":0},{"$f":"SUMIFS(INDEX(S:S,11):INDEX(S:S,100000),INDEX($F:$F,11):INDEX($F:$F,100000),$P5,INDEX($J:$J,11):INDEX($J:$J,100000),\"0_AttentionNeeded\")\n+SUMIFS(INDEX(S:S,11):INDEX(S:S,100000),INDEX($F:$F,11):INDEX($F:$F,100000),$P5,INDEX($J:$J,11):INDEX($J:$J,100000),\"1_Assigned\")\n+SUMIFS(INDEX(S:S,11):INDEX(S:S,100000),INDEX($F:$F,11):INDEX($F:$F,100000),$P5,INDEX($J:$J,11):INDEX($J:$J,100000),\"2_InProgress\")\n+SUMIFS(INDEX(S:S,11):INDEX(S:S,100000),INDEX($F:$F,11):INDEX($F:$F,100000),$P5,INDEX($J:$J,11):INDEX($J:$J,100000),\"3_Prototype\")\n+SUMIFS(INDEX(S:S,11):INDEX(S:S,100000),INDEX($F:$F,11):INDEX($F:$F,100000),$P5,INDEX($J:$J,11):INDEX($J:$J,100000),\"4_Testing\")","v":0},{"$f":"SUMIFS(INDEX(T:T,11):INDEX(T:T,100000),INDEX($F:$F,11):INDEX($F:$F,100000),$P5,INDEX($J:$J,11):INDEX($J:$J,100000),\"0_AttentionNeeded\")\n+SUMIFS(INDEX(T:T,11):INDEX(T:T,100000),INDEX($F:$F,11):INDEX($F:$F,100000),$P5,INDEX($J:$J,11):INDEX($J:$J,100000),\"1_Assigned\")\n+SUMIFS(INDEX(T:T,11):INDEX(T:T,100000),INDEX($F:$F,11):INDEX($F:$F,100000),$P5,INDEX($J:$J,11):INDEX($J:$J,100000),\"2_InProgress\")\n+SUMIFS(INDEX(T:T,11):INDEX(T:T,100000),INDEX($F:$F,11):INDEX($F:$F,100000),$P5,INDEX($J:$J,11):INDEX($J:$J,100000),\"3_Prototype\")\n+SUMIFS(INDEX(T:T,11):INDEX(T:T,100000),INDEX($F:$F,11):INDEX($F:$F,100000),$P5,INDEX($J:$J,11):INDEX($J:$J,100000),\"4_Testing\")","v":0},{"$f":"SUMIFS(INDEX(U:U,11):INDEX(U:U,100000),INDEX($F:$F,11):INDEX($F:$F,100000),$P5,INDEX($J:$J,11):INDEX($J:$J,100000),\"0_AttentionNeeded\")\n+SUMIFS(INDEX(U:U,11):INDEX(U:U,100000),INDEX($F:$F,11):INDEX($F:$F,100000),$P5,INDEX($J:$J,11):INDEX($J:$J,100000),\"1_Assigned\")\n+SUMIFS(INDEX(U:U,11):INDEX(U:U,100000),INDEX($F:$F,11):INDEX($F:$F,100000),$P5,INDEX($J:$J,11):INDEX($J:$J,100000),\"2_InProgress\")\n+SUMIFS(INDEX(U:U,11):INDEX(U:U,100000),INDEX($F:$F,11):INDEX($F:$F,100000),$P5,INDEX($J:$J,11):INDEX($J:$J,100000),\"3_Prototype\")\n+SUMIFS(INDEX(U:U,11):INDEX(U:U,100000),INDEX($F:$F,11):INDEX($F:$F,100000),$P5,INDEX($J:$J,11):INDEX($J:$J,100000),\"4_Testing\")","v":0},{"$f":"SUMIFS(INDEX(V:V,11):INDEX(V:V,100000),INDEX($F:$F,11):INDEX($F:$F,100000),$P5,INDEX($J:$J,11):INDEX($J:$J,100000),\"0_AttentionNeeded\")\n+SUMIFS(INDEX(V:V,11):INDEX(V:V,100000),INDEX($F:$F,11):INDEX($F:$F,100000),$P5,INDEX($J:$J,11):INDEX($J:$J,100000),\"1_Assigned\")\n+SUMIFS(INDEX(V:V,11):INDEX(V:V,100000),INDEX($F:$F,11):INDEX($F:$F,100000),$P5,INDEX($J:$J,11):INDEX($J:$J,100000),\"2_InProgress\")\n+SUMIFS(INDEX(V:V,11):INDEX(V:V,100000),INDEX($F:$F,11):INDEX($F:$F,100000),$P5,INDEX($J:$J,11):INDEX($J:$J,100000),\"3_Prototype\")\n+SUMIFS(INDEX(V:V,11):INDEX(V:V,100000),INDEX($F:$F,11):INDEX($F:$F,100000),$P5,INDEX($J:$J,11):INDEX($J:$J,100000),\"4_Testing\")","v":0},{"$f":"SUMIFS(INDEX(W:W,11):INDEX(W:W,100000),INDEX($F:$F,11):INDEX($F:$F,100000),$P5,INDEX($J:$J,11):INDEX($J:$J,100000),\"0_AttentionNeeded\")\n+SUMIFS(INDEX(W:W,11):INDEX(W:W,100000),INDEX($F:$F,11):INDEX($F:$F,100000),$P5,INDEX($J:$J,11):INDEX($J:$J,100000),\"1_Assigned\")\n+SUMIFS(INDEX(W:W,11):INDEX(W:W,100000),INDEX($F:$F,11):INDEX($F:$F,100000),$P5,INDEX($J:$J,11):INDEX($J:$J,100000),\"2_InProgress\")\n+SUMIFS(INDEX(W:W,11):INDEX(W:W,100000),INDEX($F:$F,11):INDEX($F:$F,100000),$P5,INDEX($J:$J,11):INDEX($J:$J,100000),\"3_Prototype\")\n+SUMIFS(INDEX(W:W,11):INDEX(W:W,100000),INDEX($F:$F,11):INDEX($F:$F,100000),$P5,INDEX($J:$J,11):INDEX($J:$J,100000),\"4_Testing\")","v":0},0,{"$f":"SUMIFS(INDEX(Y:Y,11):INDEX(Y:Y,100000),INDEX($F:$F,11):INDEX($F:$F,100000),$P5,INDEX($J:$J,11):INDEX($J:$J,100000),\"0_AttentionNeeded\")\n+SUMIFS(INDEX(Y:Y,11):INDEX(Y:Y,100000),INDEX($F:$F,11):INDEX($F:$F,100000),$P5,INDEX($J:$J,11):INDEX($J:$J,100000),\"1_Assigned\")\n+SUMIFS(INDEX(Y:Y,11):INDEX(Y:Y,100000),INDEX($F:$F,11):INDEX($F:$F,100000),$P5,INDEX($J:$J,11):INDEX($J:$J,100000),\"2_InProgress\")\n+SUMIFS(INDEX(Y:Y,11):INDEX(Y:Y,100000),INDEX($F:$F,11):INDEX($F:$F,100000),$P5,INDEX($J:$J,11):INDEX($J:$J,100000),\"3_Prototype\")\n+SUMIFS(INDEX(Y:Y,11):INDEX(Y:Y,100000),INDEX($F:$F,11):INDEX($F:$F,100000),$P5,INDEX($J:$J,11):INDEX($J:$J,100000),\"4_Testing\")","v":0},{"$f":"SUMIFS(INDEX(Z:Z,11):INDEX(Z:Z,100000),INDEX($F:$F,11):INDEX($F:$F,100000),$P5,INDEX($J:$J,11):INDEX($J:$J,100000),\"0_AttentionNeeded\")\n+SUMIFS(INDEX(Z:Z,11):INDEX(Z:Z,100000),INDEX($F:$F,11):INDEX($F:$F,100000),$P5,INDEX($J:$J,11):INDEX($J:$J,100000),\"1_Assigned\")\n+SUMIFS(INDEX(Z:Z,11):INDEX(Z:Z,100000),INDEX($F:$F,11):INDEX($F:$F,100000),$P5,INDEX($J:$J,11):INDEX($J:$J,100000),\"2_InProgress\")\n+SUMIFS(INDEX(Z:Z,11):INDEX(Z:Z,100000),INDEX($F:$F,11):INDEX($F:$F,100000),$P5,INDEX($J:$J,11):INDEX($J:$J,100000),\"3_Prototype\")\n+SUMIFS(INDEX(Z:Z,11):INDEX(Z:Z,100000),INDEX($F:$F,11):INDEX($F:$F,100000),$P5,INDEX($J:$J,11):INDEX($J:$J,100000),\"4_Testing\")","v":0},{"$f":"SUMIFS(INDEX(AA:AA,11):INDEX(AA:AA,100000),INDEX($F:$F,11):INDEX($F:$F,100000),$P5,INDEX($J:$J,11):INDEX($J:$J,100000),\"0_AttentionNeeded\")\n+SUMIFS(INDEX(AA:AA,11):INDEX(AA:AA,100000),INDEX($F:$F,11):INDEX($F:$F,100000),$P5,INDEX($J:$J,11):INDEX($J:$J,100000),\"1_Assigned\")\n+SUMIFS(INDEX(AA:AA,11):INDEX(AA:AA,100000),INDEX($F:$F,11):INDEX($F:$F,100000),$P5,INDEX($J:$J,11):INDEX($J:$J,100000),\"2_InProgress\")\n+SUMIFS(INDEX(AA:AA,11):INDEX(AA:AA,100000),INDEX($F:$F,11):INDEX($F:$F,100000),$P5,INDEX($J:$J,11):INDEX($J:$J,100000),\"3_Prototype\")\n+SUMIFS(INDEX(AA:AA,11):INDEX(AA:AA,100000),INDEX($F:$F,11):INDEX($F:$F,100000),$P5,INDEX($J:$J,11):INDEX($J:$J,100000),\"4_Testing\")","v":0},{"$f":"SUMIFS(INDEX(AB:AB,11):INDEX(AB:AB,100000),INDEX($F:$F,11):INDEX($F:$F,100000),$P5,INDEX($J:$J,11):INDEX($J:$J,100000),\"0_AttentionNeeded\")\n+SUMIFS(INDEX(AB:AB,11):INDEX(AB:AB,100000),INDEX($F:$F,11):INDEX($F:$F,100000),$P5,INDEX($J:$J,11):INDEX($J:$J,100000),\"1_Assigned\")\n+SUMIFS(INDEX(AB:AB,11):INDEX(AB:AB,100000),INDEX($F:$F,11):INDEX($F:$F,100000),$P5,INDEX($J:$J,11):INDEX($J:$J,100000),\"2_InProgress\")\n+SUMIFS(INDEX(AB:AB,11):INDEX(AB:AB,100000),INDEX($F:$F,11):INDEX($F:$F,100000),$P5,INDEX($J:$J,11):INDEX($J:$J,100000),\"3_Prototype\")\n+SUMIFS(INDEX(AB:AB,11):INDEX(AB:AB,100000),INDEX($F:$F,11):INDEX($F:$F,100000),$P5,INDEX($J:$J,11):INDEX($J:$J,100000),\"4_Testing\")","v":0},{"$f":"SUMIFS(INDEX(AC:AC,11):INDEX(AC:AC,100000),INDEX($F:$F,11):INDEX($F:$F,100000),$P5,INDEX($J:$J,11):INDEX($J:$J,100000),\"0_AttentionNeeded\")\n+SUMIFS(INDEX(AC:AC,11):INDEX(AC:AC,100000),INDEX($F:$F,11):INDEX($F:$F,100000),$P5,INDEX($J:$J,11):INDEX($J:$J,100000),\"1_Assigned\")\n+SUMIFS(INDEX(AC:AC,11):INDEX(AC:AC,100000),INDEX($F:$F,11):INDEX($F:$F,100000),$P5,INDEX($J:$J,11):INDEX($J:$J,100000),\"2_InProgress\")\n+SUMIFS(INDEX(AC:AC,11):INDEX(AC:AC,100000),INDEX($F:$F,11):INDEX($F:$F,100000),$P5,INDEX($J:$J,11):INDEX($J:$J,100000),\"3_Prototype\")\n+SUMIFS(INDEX(AC:AC,11):INDEX(AC:AC,100000),INDEX($F:$F,11):INDEX($F:$F,100000),$P5,INDEX($J:$J,11):INDEX($J:$J,100000),\"4_Testing\")","v":0},{"$f":"SUMIFS(INDEX(AD:AD,11):INDEX(AD:AD,100000),INDEX($F:$F,11):INDEX($F:$F,100000),$P5,INDEX($J:$J,11):INDEX($J:$J,100000),\"0_AttentionNeeded\")\n+SUMIFS(INDEX(AD:AD,11):INDEX(AD:AD,100000),INDEX($F:$F,11):INDEX($F:$F,100000),$P5,INDEX($J:$J,11):INDEX($J:$J,100000),\"1_Assigned\")\n+SUMIFS(INDEX(AD:AD,11):INDEX(AD:AD,100000),INDEX($F:$F,11):INDEX($F:$F,100000),$P5,INDEX($J:$J,11):INDEX($J:$J,100000),\"2_InProgress\")\n+SUMIFS(INDEX(AD:AD,11):INDEX(AD:AD,100000),INDEX($F:$F,11):INDEX($F:$F,100000),$P5,INDEX($J:$J,11):INDEX($J:$J,100000),\"3_Prototype\")\n+SUMIFS(INDEX(AD:AD,11):INDEX(AD:AD,100000),INDEX($F:$F,11):INDEX($F:$F,100000),$P5,INDEX($J:$J,11):INDEX($J:$J,100000),\"4_Testing\")","v":0},0,{"$f":"SUMIFS(INDEX(AF:AF,11):INDEX(AF:AF,100000),INDEX($F:$F,11):INDEX($F:$F,100000),$P5,INDEX($J:$J,11):INDEX($J:$J,100000),\"0_AttentionNeeded\")\n+SUMIFS(INDEX(AF:AF,11):INDEX(AF:AF,100000),INDEX($F:$F,11):INDEX($F:$F,100000),$P5,INDEX($J:$J,11):INDEX($J:$J,100000),\"1_Assigned\")\n+SUMIFS(INDEX(AF:AF,11):INDEX(AF:AF,100000),INDEX($F:$F,11):INDEX($F:$F,100000),$P5,INDEX($J:$J,11):INDEX($J:$J,100000),\"2_InProgress\")\n+SUMIFS(INDEX(AF:AF,11):INDEX(AF:AF,100000),INDEX($F:$F,11):INDEX($F:$F,100000),$P5,INDEX($J:$J,11):INDEX($J:$J,100000),\"3_Prototype\")\n+SUMIFS(INDEX(AF:AF,11):INDEX(AF:AF,100000),INDEX($F:$F,11):INDEX($F:$F,100000),$P5,INDEX($J:$J,11):INDEX($J:$J,100000),\"4_Testing\")","v":0},{"$f":"SUMIFS(INDEX(AG:AG,11):INDEX(AG:AG,100000),INDEX($F:$F,11):INDEX($F:$F,100000),$P5,INDEX($J:$J,11):INDEX($J:$J,100000),\"0_AttentionNeeded\")\n+SUMIFS(INDEX(AG:AG,11):INDEX(AG:AG,100000),INDEX($F:$F,11):INDEX($F:$F,100000),$P5,INDEX($J:$J,11):INDEX($J:$J,100000),\"1_Assigned\")\n+SUMIFS(INDEX(AG:AG,11):INDEX(AG:AG,100000),INDEX($F:$F,11):INDEX($F:$F,100000),$P5,INDEX($J:$J,11):INDEX($J:$J,100000),\"2_InProgress\")\n+SUMIFS(INDEX(AG:AG,11):INDEX(AG:AG,100000),INDEX($F:$F,11):INDEX($F:$F,100000),$P5,INDEX($J:$J,11):INDEX($J:$J,100000),\"3_Prototype\")\n+SUMIFS(INDEX(AG:AG,11):INDEX(AG:AG,100000),INDEX($F:$F,11):INDEX($F:$F,100000),$P5,INDEX($J:$J,11):INDEX($J:$J,100000),\"4_Testing\")","v":0},{"$f":"SUMIFS(INDEX(AH:AH,11):INDEX(AH:AH,100000),INDEX($F:$F,11):INDEX($F:$F,100000),$P5,INDEX($J:$J,11):INDEX($J:$J,100000),\"0_AttentionNeeded\")\n+SUMIFS(INDEX(AH:AH,11):INDEX(AH:AH,100000),INDEX($F:$F,11):INDEX($F:$F,100000),$P5,INDEX($J:$J,11):INDEX($J:$J,100000),\"1_Assigned\")\n+SUMIFS(INDEX(AH:AH,11):INDEX(AH:AH,100000),INDEX($F:$F,11):INDEX($F:$F,100000),$P5,INDEX($J:$J,11):INDEX($J:$J,100000),\"2_InProgress\")\n+SUMIFS(INDEX(AH:AH,11):INDEX(AH:AH,100000),INDEX($F:$F,11):INDEX($F:$F,100000),$P5,INDEX($J:$J,11):INDEX($J:$J,100000),\"3_Prototype\")\n+SUMIFS(INDEX(AH:AH,11):INDEX(AH:AH,100000),INDEX($F:$F,11):INDEX($F:$F,100000),$P5,INDEX($J:$J,11):INDEX($J:$J,100000),\"4_Testing\")","v":0},{"$f":"SUMIFS(INDEX(AI:AI,11):INDEX(AI:AI,100000),INDEX($F:$F,11):INDEX($F:$F,100000),$P5,INDEX($J:$J,11):INDEX($J:$J,100000),\"0_AttentionNeeded\")\n+SUMIFS(INDEX(AI:AI,11):INDEX(AI:AI,100000),INDEX($F:$F,11):INDEX($F:$F,100000),$P5,INDEX($J:$J,11):INDEX($J:$J,100000),\"1_Assigned\")\n+SUMIFS(INDEX(AI:AI,11):INDEX(AI:AI,100000),INDEX($F:$F,11):INDEX($F:$F,100000),$P5,INDEX($J:$J,11):INDEX($J:$J,100000),\"2_InProgress\")\n+SUMIFS(INDEX(AI:AI,11):INDEX(AI:AI,100000),INDEX($F:$F,11):INDEX($F:$F,100000),$P5,INDEX($J:$J,11):INDEX($J:$J,100000),\"3_Prototype\")\n+SUMIFS(INDEX(AI:AI,11):INDEX(AI:AI,100000),INDEX($F:$F,11):INDEX($F:$F,100000),$P5,INDEX($J:$J,11):INDEX($J:$J,100000),\"4_Testing\")","v":0},{"$f":"SUMIFS(INDEX(AJ:AJ,11):INDEX(AJ:AJ,100000),INDEX($F:$F,11):INDEX($F:$F,100000),$P5,INDEX($J:$J,11):INDEX($J:$J,100000),\"0_AttentionNeeded\")\n+SUMIFS(INDEX(AJ:AJ,11):INDEX(AJ:AJ,100000),INDEX($F:$F,11):INDEX($F:$F,100000),$P5,INDEX($J:$J,11):INDEX($J:$J,100000),\"1_Assigned\")\n+SUMIFS(INDEX(AJ:AJ,11):INDEX(AJ:AJ,100000),INDEX($F:$F,11):INDEX($F:$F,100000),$P5,INDEX($J:$J,11):INDEX($J:$J,100000),\"2_InProgress\")\n+SUMIFS(INDEX(AJ:AJ,11):INDEX(AJ:AJ,100000),INDEX($F:$F,11):INDEX($F:$F,100000),$P5,INDEX($J:$J,11):INDEX($J:$J,100000),\"3_Prototype\")\n+SUMIFS(INDEX(AJ:AJ,11):INDEX(AJ:AJ,100000),INDEX($F:$F,11):INDEX($F:$F,100000),$P5,INDEX($J:$J,11):INDEX($J:$J,100000),\"4_Testing\")","v":0},{"$f":"SUMIFS(INDEX(AK:AK,11):INDEX(AK:AK,100000),INDEX($F:$F,11):INDEX($F:$F,100000),$P5,INDEX($J:$J,11):INDEX($J:$J,100000),\"0_AttentionNeeded\")\n+SUMIFS(INDEX(AK:AK,11):INDEX(AK:AK,100000),INDEX($F:$F,11):INDEX($F:$F,100000),$P5,INDEX($J:$J,11):INDEX($J:$J,100000),\"1_Assigned\")\n+SUMIFS(INDEX(AK:AK,11):INDEX(AK:AK,100000),INDEX($F:$F,11):INDEX($F:$F,100000),$P5,INDEX($J:$J,11):INDEX($J:$J,100000),\"2_InProgress\")\n+SUMIFS(INDEX(AK:AK,11):INDEX(AK:AK,100000),INDEX($F:$F,11):INDEX($F:$F,100000),$P5,INDEX($J:$J,11):INDEX($J:$J,100000),\"3_Prototype\")\n+SUMIFS(INDEX(AK:AK,11):INDEX(AK:AK,100000),INDEX($F:$F,11):INDEX($F:$F,100000),$P5,INDEX($J:$J,11):INDEX($J:$J,100000),\"4_Testing\")","v":0},0,{"$f":"SUMIFS(INDEX(AM:AM,11):INDEX(AM:AM,100000),INDEX($F:$F,11):INDEX($F:$F,100000),$P5,INDEX($J:$J,11):INDEX($J:$J,100000),\"0_AttentionNeeded\")\n+SUMIFS(INDEX(AM:AM,11):INDEX(AM:AM,100000),INDEX($F:$F,11):INDEX($F:$F,100000),$P5,INDEX($J:$J,11):INDEX($J:$J,100000),\"1_Assigned\")\n+SUMIFS(INDEX(AM:AM,11):INDEX(AM:AM,100000),INDEX($F:$F,11):INDEX($F:$F,100000),$P5,INDEX($J:$J,11):INDEX($J:$J,100000),\"2_InProgress\")\n+SUMIFS(INDEX(AM:AM,11):INDEX(AM:AM,100000),INDEX($F:$F,11):INDEX($F:$F,100000),$P5,INDEX($J:$J,11):INDEX($J:$J,100000),\"3_Prototype\")\n+SUMIFS(INDEX(AM:AM,11):INDEX(AM:AM,100000),INDEX($F:$F,11):INDEX($F:$F,100000),$P5,INDEX($J:$J,11):INDEX($J:$J,100000),\"4_Testing\")","v":0},{"$f":"SUMIFS(INDEX(AN:AN,11):INDEX(AN:AN,100000),INDEX($F:$F,11):INDEX($F:$F,100000),$P5,INDEX($J:$J,11):INDEX($J:$J,100000),\"0_AttentionNeeded\")\n+SUMIFS(INDEX(AN:AN,11):INDEX(AN:AN,100000),INDEX($F:$F,11):INDEX($F:$F,100000),$P5,INDEX($J:$J,11):INDEX($J:$J,100000),\"1_Assigned\")\n+SUMIFS(INDEX(AN:AN,11):INDEX(AN:AN,100000),INDEX($F:$F,11):INDEX($F:$F,100000),$P5,INDEX($J:$J,11):INDEX($J:$J,100000),\"2_InProgress\")\n+SUMIFS(INDEX(AN:AN,11):INDEX(AN:AN,100000),INDEX($F:$F,11):INDEX($F:$F,100000),$P5,INDEX($J:$J,11):INDEX($J:$J,100000),\"3_Prototype\")\n+SUMIFS(INDEX(AN:AN,11):INDEX(AN:AN,100000),INDEX($F:$F,11):INDEX($F:$F,100000),$P5,INDEX($J:$J,11):INDEX($J:$J,100000),\"4_Testing\")","v":0},{"$f":"SUMIFS(INDEX(AO:AO,11):INDEX(AO:AO,100000),INDEX($F:$F,11):INDEX($F:$F,100000),$P5,INDEX($J:$J,11):INDEX($J:$J,100000),\"0_AttentionNeeded\")\n+SUMIFS(INDEX(AO:AO,11):INDEX(AO:AO,100000),INDEX($F:$F,11):INDEX($F:$F,100000),$P5,INDEX($J:$J,11):INDEX($J:$J,100000),\"1_Assigned\")\n+SUMIFS(INDEX(AO:AO,11):INDEX(AO:AO,100000),INDEX($F:$F,11):INDEX($F:$F,100000),$P5,INDEX($J:$J,11):INDEX($J:$J,100000),\"2_InProgress\")\n+SUMIFS(INDEX(AO:AO,11):INDEX(AO:AO,100000),INDEX($F:$F,11):INDEX($F:$F,100000),$P5,INDEX($J:$J,11):INDEX($J:$J,100000),\"3_Prototype\")\n+SUMIFS(INDEX(AO:AO,11):INDEX(AO:AO,100000),INDEX($F:$F,11):INDEX($F:$F,100000),$P5,INDEX($J:$J,11):INDEX($J:$J,100000),\"4_Testing\")","v":0},{"$f":"SUMIFS(INDEX(AP:AP,11):INDEX(AP:AP,100000),INDEX($F:$F,11):INDEX($F:$F,100000),$P5,INDEX($J:$J,11):INDEX($J:$J,100000),\"0_AttentionNeeded\")\n+SUMIFS(INDEX(AP:AP,11):INDEX(AP:AP,100000),INDEX($F:$F,11):INDEX($F:$F,100000),$P5,INDEX($J:$J,11):INDEX($J:$J,100000),\"1_Assigned\")\n+SUMIFS(INDEX(AP:AP,11):INDEX(AP:AP,100000),INDEX($F:$F,11):INDEX($F:$F,100000),$P5,INDEX($J:$J,11):INDEX($J:$J,100000),\"2_InProgress\")\n+SUMIFS(INDEX(AP:AP,11):INDEX(AP:AP,100000),INDEX($F:$F,11):INDEX($F:$F,100000),$P5,INDEX($J:$J,11):INDEX($J:$J,100000),\"3_Prototype\")\n+SUMIFS(INDEX(AP:AP,11):INDEX(AP:AP,100000),INDEX($F:$F,11):INDEX($F:$F,100000),$P5,INDEX($J:$J,11):INDEX($J:$J,100000),\"4_Testing\")","v":0},{"$f":"SUMIFS(INDEX(AQ:AQ,11):INDEX(AQ:AQ,100000),INDEX($F:$F,11):INDEX($F:$F,100000),$P5,INDEX($J:$J,11):INDEX($J:$J,100000),\"0_AttentionNeeded\")\n+SUMIFS(INDEX(AQ:AQ,11):INDEX(AQ:AQ,100000),INDEX($F:$F,11):INDEX($F:$F,100000),$P5,INDEX($J:$J,11):INDEX($J:$J,100000),\"1_Assigned\")\n+SUMIFS(INDEX(AQ:AQ,11):INDEX(AQ:AQ,100000),INDEX($F:$F,11):INDEX($F:$F,100000),$P5,INDEX($J:$J,11):INDEX($J:$J,100000),\"2_InProgress\")\n+SUMIFS(INDEX(AQ:AQ,11):INDEX(AQ:AQ,100000),INDEX($F:$F,11):INDEX($F:$F,100000),$P5,INDEX($J:$J,11):INDEX($J:$J,100000),\"3_Prototype\")\n+SUMIFS(INDEX(AQ:AQ,11):INDEX(AQ:AQ,100000),INDEX($F:$F,11):INDEX($F:$F,100000),$P5,INDEX($J:$J,11):INDEX($J:$J,100000),\"4_Testing\")","v":0},{"$f":"SUMIFS(INDEX(AR:AR,11):INDEX(AR:AR,100000),INDEX($F:$F,11):INDEX($F:$F,100000),$P5,INDEX($J:$J,11):INDEX($J:$J,100000),\"0_AttentionNeeded\")\n+SUMIFS(INDEX(AR:AR,11):INDEX(AR:AR,100000),INDEX($F:$F,11):INDEX($F:$F,100000),$P5,INDEX($J:$J,11):INDEX($J:$J,100000),\"1_Assigned\")\n+SUMIFS(INDEX(AR:AR,11):INDEX(AR:AR,100000),INDEX($F:$F,11):INDEX($F:$F,100000),$P5,INDEX($J:$J,11):INDEX($J:$J,100000),\"2_InProgress\")\n+SUMIFS(INDEX(AR:AR,11):INDEX(AR:AR,100000),INDEX($F:$F,11):INDEX($F:$F,100000),$P5,INDEX($J:$J,11):INDEX($J:$J,100000),\"3_Prototype\")\n+SUMIFS(INDEX(AR:AR,11):INDEX(AR:AR,100000),INDEX($F:$F,11):INDEX($F:$F,100000),$P5,INDEX($J:$J,11):INDEX($J:$J,100000),\"4_Testing\")","v":0},0,{"$f":"SUMIFS(INDEX(AT:AT,11):INDEX(AT:AT,100000),INDEX($F:$F,11):INDEX($F:$F,100000),$P5,INDEX($J:$J,11):INDEX($J:$J,100000),\"0_AttentionNeeded\")\n+SUMIFS(INDEX(AT:AT,11):INDEX(AT:AT,100000),INDEX($F:$F,11):INDEX($F:$F,100000),$P5,INDEX($J:$J,11):INDEX($J:$J,100000),\"1_Assigned\")\n+SUMIFS(INDEX(AT:AT,11):INDEX(AT:AT,100000),INDEX($F:$F,11):INDEX($F:$F,100000),$P5,INDEX($J:$J,11):INDEX($J:$J,100000),\"2_InProgress\")\n+SUMIFS(INDEX(AT:AT,11):INDEX(AT:AT,100000),INDEX($F:$F,11):INDEX($F:$F,100000),$P5,INDEX($J:$J,11):INDEX($J:$J,100000),\"3_Prototype\")\n+SUMIFS(INDEX(AT:AT,11):INDEX(AT:AT,100000),INDEX($F:$F,11):INDEX($F:$F,100000),$P5,INDEX($J:$J,11):INDEX($J:$J,100000),\"4_Testing\")","v":0},{"$f":"SUMIFS(INDEX(AU:AU,11):INDEX(AU:AU,100000),INDEX($F:$F,11):INDEX($F:$F,100000),$P5,INDEX($J:$J,11):INDEX($J:$J,100000),\"0_AttentionNeeded\")\n+SUMIFS(INDEX(AU:AU,11):INDEX(AU:AU,100000),INDEX($F:$F,11):INDEX($F:$F,100000),$P5,INDEX($J:$J,11):INDEX($J:$J,100000),\"1_Assigned\")\n+SUMIFS(INDEX(AU:AU,11):INDEX(AU:AU,100000),INDEX($F:$F,11):INDEX($F:$F,100000),$P5,INDEX($J:$J,11):INDEX($J:$J,100000),\"2_InProgress\")\n+SUMIFS(INDEX(AU:AU,11):INDEX(AU:AU,100000),INDEX($F:$F,11):INDEX($F:$F,100000),$P5,INDEX($J:$J,11):INDEX($J:$J,100000),\"3_Prototype\")\n+SUMIFS(INDEX(AU:AU,11):INDEX(AU:AU,100000),INDEX($F:$F,11):INDEX($F:$F,100000),$P5,INDEX($J:$J,11):INDEX($J:$J,100000),\"4_Testing\")","v":0},{"$f":"SUMIFS(INDEX(AV:AV,11):INDEX(AV:AV,100000),INDEX($F:$F,11):INDEX($F:$F,100000),$P5,INDEX($J:$J,11):INDEX($J:$J,100000),\"0_AttentionNeeded\")\n+SUMIFS(INDEX(AV:AV,11):INDEX(AV:AV,100000),INDEX($F:$F,11):INDEX($F:$F,100000),$P5,INDEX($J:$J,11):INDEX($J:$J,100000),\"1_Assigned\")\n+SUMIFS(INDEX(AV:AV,11):INDEX(AV:AV,100000),INDEX($F:$F,11):INDEX($F:$F,100000),$P5,INDEX($J:$J,11):INDEX($J:$J,100000),\"2_InProgress\")\n+SUMIFS(INDEX(AV:AV,11):INDEX(AV:AV,100000),INDEX($F:$F,11):INDEX($F:$F,100000),$P5,INDEX($J:$J,11):INDEX($J:$J,100000),\"3_Prototype\")\n+SUMIFS(INDEX(AV:AV,11):INDEX(AV:AV,100000),INDEX($F:$F,11):INDEX($F:$F,100000),$P5,INDEX($J:$J,11):INDEX($J:$J,100000),\"4_Testing\")","v":0},{"$f":"SUMIFS(INDEX(AW:AW,11):INDEX(AW:AW,100000),INDEX($F:$F,11):INDEX($F:$F,100000),$P5,INDEX($J:$J,11):INDEX($J:$J,100000),\"0_AttentionNeeded\")\n+SUMIFS(INDEX(AW:AW,11):INDEX(AW:AW,100000),INDEX($F:$F,11):INDEX($F:$F,100000),$P5,INDEX($J:$J,11):INDEX($J:$J,100000),\"1_Assigned\")\n+SUMIFS(INDEX(AW:AW,11):INDEX(AW:AW,100000),INDEX($F:$F,11):INDEX($F:$F,100000),$P5,INDEX($J:$J,11):INDEX($J:$J,100000),\"2_InProgress\")\n+SUMIFS(INDEX(AW:AW,11):INDEX(AW:AW,100000),INDEX($F:$F,11):INDEX($F:$F,100000),$P5,INDEX($J:$J,11):INDEX($J:$J,100000),\"3_Prototype\")\n+SUMIFS(INDEX(AW:AW,11):INDEX(AW:AW,100000),INDEX($F:$F,11):INDEX($F:$F,100000),$P5,INDEX($J:$J,11):INDEX($J:$J,100000),\"4_Testing\")","v":0},{"$f":"SUMIFS(INDEX(AX:AX,11):INDEX(AX:AX,100000),INDEX($F:$F,11):INDEX($F:$F,100000),$P5,INDEX($J:$J,11):INDEX($J:$J,100000),\"0_AttentionNeeded\")\n+SUMIFS(INDEX(AX:AX,11):INDEX(AX:AX,100000),INDEX($F:$F,11):INDEX($F:$F,100000),$P5,INDEX($J:$J,11):INDEX($J:$J,100000),\"1_Assigned\")\n+SUMIFS(INDEX(AX:AX,11):INDEX(AX:AX,100000),INDEX($F:$F,11):INDEX($F:$F,100000),$P5,INDEX($J:$J,11):INDEX($J:$J,100000),\"2_InProgress\")\n+SUMIFS(INDEX(AX:AX,11):INDEX(AX:AX,100000),INDEX($F:$F,11):INDEX($F:$F,100000),$P5,INDEX($J:$J,11):INDEX($J:$J,100000),\"3_Prototype\")\n+SUMIFS(INDEX(AX:AX,11):INDEX(AX:AX,100000),INDEX($F:$F,11):INDEX($F:$F,100000),$P5,INDEX($J:$J,11):INDEX($J:$J,100000),\"4_Testing\")","v":0},{"$f":"SUMIFS(INDEX(AY:AY,11):INDEX(AY:AY,100000),INDEX($F:$F,11):INDEX($F:$F,100000),$P5,INDEX($J:$J,11):INDEX($J:$J,100000),\"0_AttentionNeeded\")\n+SUMIFS(INDEX(AY:AY,11):INDEX(AY:AY,100000),INDEX($F:$F,11):INDEX($F:$F,100000),$P5,INDEX($J:$J,11):INDEX($J:$J,100000),\"1_Assigned\")\n+SUMIFS(INDEX(AY:AY,11):INDEX(AY:AY,100000),INDEX($F:$F,11):INDEX($F:$F,100000),$P5,INDEX($J:$J,11):INDEX($J:$J,100000),\"2_InProgress\")\n+SUMIFS(INDEX(AY:AY,11):INDEX(AY:AY,100000),INDEX($F:$F,11):INDEX($F:$F,100000),$P5,INDEX($J:$J,11):INDEX($J:$J,100000),\"3_Prototype\")\n+SUMIFS(INDEX(AY:AY,11):INDEX(AY:AY,100000),INDEX($F:$F,11):INDEX($F:$F,100000),$P5,INDEX($J:$J,11):INDEX($J:$J,100000),\"4_Testing\")","v":0},0,{"$f":"SUMIFS(INDEX(BA:BA,11):INDEX(BA:BA,100000),INDEX($F:$F,11):INDEX($F:$F,100000),$P5,INDEX($J:$J,11):INDEX($J:$J,100000),\"0_AttentionNeeded\")\n+SUMIFS(INDEX(BA:BA,11):INDEX(BA:BA,100000),INDEX($F:$F,11):INDEX($F:$F,100000),$P5,INDEX($J:$J,11):INDEX($J:$J,100000),\"1_Assigned\")\n+SUMIFS(INDEX(BA:BA,11):INDEX(BA:BA,100000),INDEX($F:$F,11):INDEX($F:$F,100000),$P5,INDEX($J:$J,11):INDEX($J:$J,100000),\"2_InProgress\")\n+SUMIFS(INDEX(BA:BA,11):INDEX(BA:BA,100000),INDEX($F:$F,11):INDEX($F:$F,100000),$P5,INDEX($J:$J,11):INDEX($J:$J,100000),\"3_Prototype\")\n+SUMIFS(INDEX(BA:BA,11):INDEX(BA:BA,100000),INDEX($F:$F,11):INDEX($F:$F,100000),$P5,INDEX($J:$J,11):INDEX($J:$J,100000),\"4_Testing\")","v":0},{"$f":"SUMIFS(INDEX(BB:BB,11):INDEX(BB:BB,100000),INDEX($F:$F,11):INDEX($F:$F,100000),$P5,INDEX($J:$J,11):INDEX($J:$J,100000),\"0_AttentionNeeded\")\n+SUMIFS(INDEX(BB:BB,11):INDEX(BB:BB,100000),INDEX($F:$F,11):INDEX($F:$F,100000),$P5,INDEX($J:$J,11):INDEX($J:$J,100000),\"1_Assigned\")\n+SUMIFS(INDEX(BB:BB,11):INDEX(BB:BB,100000),INDEX($F:$F,11):INDEX($F:$F,100000),$P5,INDEX($J:$J,11):INDEX($J:$J,100000),\"2_InProgress\")\n+SUMIFS(INDEX(BB:BB,11):INDEX(BB:BB,100000),INDEX($F:$F,11):INDEX($F:$F,100000),$P5,INDEX($J:$J,11):INDEX($J:$J,100000),\"3_Prototype\")\n+SUMIFS(INDEX(BB:BB,11):INDEX(BB:BB,100000),INDEX($F:$F,11):INDEX($F:$F,100000),$P5,INDEX($J:$J,11):INDEX($J:$J,100000),\"4_Testing\")","v":0},{"$f":"SUMIFS(INDEX(BC:BC,11):INDEX(BC:BC,100000),INDEX($F:$F,11):INDEX($F:$F,100000),$P5,INDEX($J:$J,11):INDEX($J:$J,100000),\"0_AttentionNeeded\")\n+SUMIFS(INDEX(BC:BC,11):INDEX(BC:BC,100000),INDEX($F:$F,11):INDEX($F:$F,100000),$P5,INDEX($J:$J,11):INDEX($J:$J,100000),\"1_Assigned\")\n+SUMIFS(INDEX(BC:BC,11):INDEX(BC:BC,100000),INDEX($F:$F,11):INDEX($F:$F,100000),$P5,INDEX($J:$J,11):INDEX($J:$J,100000),\"2_InProgress\")\n+SUMIFS(INDEX(BC:BC,11):INDEX(BC:BC,100000),INDEX($F:$F,11):INDEX($F:$F,100000),$P5,INDEX($J:$J,11):INDEX($J:$J,100000),\"3_Prototype\")\n+SUMIFS(INDEX(BC:BC,11):INDEX(BC:BC,100000),INDEX($F:$F,11):INDEX($F:$F,100000),$P5,INDEX($J:$J,11):INDEX($J:$J,100000),\"4_Testing\")","v":0},{"$f":"SUMIFS(INDEX(BD:BD,11):INDEX(BD:BD,100000),INDEX($F:$F,11):INDEX($F:$F,100000),$P5,INDEX($J:$J,11):INDEX($J:$J,100000),\"0_AttentionNeeded\")\n+SUMIFS(INDEX(BD:BD,11):INDEX(BD:BD,100000),INDEX($F:$F,11):INDEX($F:$F,100000),$P5,INDEX($J:$J,11):INDEX($J:$J,100000),\"1_Assigned\")\n+SUMIFS(INDEX(BD:BD,11):INDEX(BD:BD,100000),INDEX($F:$F,11):INDEX($F:$F,100000),$P5,INDEX($J:$J,11):INDEX($J:$J,100000),\"2_InProgress\")\n+SUMIFS(INDEX(BD:BD,11):INDEX(BD:BD,100000),INDEX($F:$F,11):INDEX($F:$F,100000),$P5,INDEX($J:$J,11):INDEX($J:$J,100000),\"3_Prototype\")\n+SUMIFS(INDEX(BD:BD,11):INDEX(BD:BD,100000),INDEX($F:$F,11):INDEX($F:$F,100000),$P5,INDEX($J:$J,11):INDEX($J:$J,100000),\"4_Testing\")","v":0},{"$f":"SUMIFS(INDEX(BE:BE,11):INDEX(BE:BE,100000),INDEX($F:$F,11):INDEX($F:$F,100000),$P5,INDEX($J:$J,11):INDEX($J:$J,100000),\"0_AttentionNeeded\")\n+SUMIFS(INDEX(BE:BE,11):INDEX(BE:BE,100000),INDEX($F:$F,11):INDEX($F:$F,100000),$P5,INDEX($J:$J,11):INDEX($J:$J,100000),\"1_Assigned\")\n+SUMIFS(INDEX(BE:BE,11):INDEX(BE:BE,100000),INDEX($F:$F,11):INDEX($F:$F,100000),$P5,INDEX($J:$J,11):INDEX($J:$J,100000),\"2_InProgress\")\n+SUMIFS(INDEX(BE:BE,11):INDEX(BE:BE,100000),INDEX($F:$F,11):INDEX($F:$F,100000),$P5,INDEX($J:$J,11):INDEX($J:$J,100000),\"3_Prototype\")\n+SUMIFS(INDEX(BE:BE,11):INDEX(BE:BE,100000),INDEX($F:$F,11):INDEX($F:$F,100000),$P5,INDEX($J:$J,11):INDEX($J:$J,100000),\"4_Testing\")","v":0},{"$f":"SUMIFS(INDEX(BF:BF,11):INDEX(BF:BF,100000),INDEX($F:$F,11):INDEX($F:$F,100000),$P5,INDEX($J:$J,11):INDEX($J:$J,100000),\"0_AttentionNeeded\")\n+SUMIFS(INDEX(BF:BF,11):INDEX(BF:BF,100000),INDEX($F:$F,11):INDEX($F:$F,100000),$P5,INDEX($J:$J,11):INDEX($J:$J,100000),\"1_Assigned\")\n+SUMIFS(INDEX(BF:BF,11):INDEX(BF:BF,100000),INDEX($F:$F,11):INDEX($F:$F,100000),$P5,INDEX($J:$J,11):INDEX($J:$J,100000),\"2_InProgress\")\n+SUMIFS(INDEX(BF:BF,11):INDEX(BF:BF,100000),INDEX($F:$F,11):INDEX($F:$F,100000),$P5,INDEX($J:$J,11):INDEX($J:$J,100000),\"3_Prototype\")\n+SUMIFS(INDEX(BF:BF,11):INDEX(BF:BF,100000),INDEX($F:$F,11):INDEX($F:$F,100000),$P5,INDEX($J:$J,11):INDEX($J:$J,100000),\"4_Testing\")","v":0}]
[null,null,null,null,null,null,null,null,null,null,null,null,null,null,null,"N3",0,{"$f":"SUMIFS(INDEX(R:R,11):INDEX(R:R,100000),INDEX($F:$F,11):INDEX($F:$F,100000),$P6,INDEX($J:$J,11):INDEX($J:$J,100000),\"0_AttentionNeeded\")\n+SUMIFS(INDEX(R:R,11):INDEX(R:R,100000),INDEX($F:$F,11):INDEX($F:$F,100000),$P6,INDEX($J:$J,11):INDEX($J:$J,100000),\"1_Assigned\")\n+SUMIFS(INDEX(R:R,11):INDEX(R:R,100000),INDEX($F:$F,11):INDEX($F:$F,100000),$P6,INDEX($J:$J,11):INDEX($J:$J,100000),\"2_InProgress\")\n+SUMIFS(INDEX(R:R,11):INDEX(R:R,100000),INDEX($F:$F,11):INDEX($F:$F,100000),$P6,INDEX($J:$J,11):INDEX($J:$J,100000),\"3_Prototype\")\n+SUMIFS(INDEX(R:R,11):INDEX(R:R,100000),INDEX($F:$F,11):INDEX($F:$F,100000),$P6,INDEX($J:$J,11):INDEX($J:$J,100000),\"4_Testing\")","v":0},{"$f":"SUMIFS(INDEX(S:S,11):INDEX(S:S,100000),INDEX($F:$F,11):INDEX($F:$F,100000),$P6,INDEX($J:$J,11):INDEX($J:$J,100000),\"0_AttentionNeeded\")\n+SUMIFS(INDEX(S:S,11):INDEX(S:S,100000),INDEX($F:$F,11):INDEX($F:$F,100000),$P6,INDEX($J:$J,11):INDEX($J:$J,100000),\"1_Assigned\")\n+SUMIFS(INDEX(S:S,11):INDEX(S:S,100000),INDEX($F:$F,11):INDEX($F:$F,100000),$P6,INDEX($J:$J,11):INDEX($J:$J,100000),\"2_InProgress\")\n+SUMIFS(INDEX(S:S,11):INDEX(S:S,100000),INDEX($F:$F,11):INDEX($F:$F,100000),$P6,INDEX($J:$J,11):INDEX($J:$J,100000),\"3_Prototype\")\n+SUMIFS(INDEX(S:S,11):INDEX(S:S,100000),INDEX($F:$F,11):INDEX($F:$F,100000),$P6,INDEX($J:$J,11):INDEX($J:$J,100000),\"4_Testing\")","v":0},{"$f":"SUMIFS(INDEX(T:T,11):INDEX(T:T,100000),INDEX($F:$F,11):INDEX($F:$F,100000),$P6,INDEX($J:$J,11):INDEX($J:$J,100000),\"0_AttentionNeeded\")\n+SUMIFS(INDEX(T:T,11):INDEX(T:T,100000),INDEX($F:$F,11):INDEX($F:$F,100000),$P6,INDEX($J:$J,11):INDEX($J:$J,100000),\"1_Assigned\")\n+SUMIFS(INDEX(T:T,11):INDEX(T:T,100000),INDEX($F:$F,11):INDEX($F:$F,100000),$P6,INDEX($J:$J,11):INDEX($J:$J,100000),\"2_InProgress\")\n+SUMIFS(INDEX(T:T,11):INDEX(T:T,100000),INDEX($F:$F,11):INDEX($F:$F,100000),$P6,INDEX($J:$J,11):INDEX($J:$J,100000),\"3_Prototype\")\n+SUMIFS(INDEX(T:T,11):INDEX(T:T,100000),INDEX($F:$F,11):INDEX($F:$F,100000),$P6,INDEX($J:$J,11):INDEX($J:$J,100000),\"4_Testing\")","v":0},{"$f":"SUMIFS(INDEX(U:U,11):INDEX(U:U,100000),INDEX($F:$F,11):INDEX($F:$F,100000),$P6,INDEX($J:$J,11):INDEX($J:$J,100000),\"0_AttentionNeeded\")\n+SUMIFS(INDEX(U:U,11):INDEX(U:U,100000),INDEX($F:$F,11):INDEX($F:$F,100000),$P6,INDEX($J:$J,11):INDEX($J:$J,100000),\"1_Assigned\")\n+SUMIFS(INDEX(U:U,11):INDEX(U:U,100000),INDEX($F:$F,11):INDEX($F:$F,100000),$P6,INDEX($J:$J,11):INDEX($J:$J,100000),\"2_InProgress\")\n+SUMIFS(INDEX(U:U,11):INDEX(U:U,100000),INDEX($F:$F,11):INDEX($F:$F,100000),$P6,INDEX($J:$J,11):INDEX($J:$J,100000),\"3_Prototype\")\n+SUMIFS(INDEX(U:U,11):INDEX(U:U,100000),INDEX($F:$F,11):INDEX($F:$F,100000),$P6,INDEX($J:$J,11):INDEX($J:$J,100000),\"4_Testing\")","v":0},{"$f":"SUMIFS(INDEX(V:V,11):INDEX(V:V,100000),INDEX($F:$F,11):INDEX($F:$F,100000),$P6,INDEX($J:$J,11):INDEX($J:$J,100000),\"0_AttentionNeeded\")\n+SUMIFS(INDEX(V:V,11):INDEX(V:V,100000),INDEX($F:$F,11):INDEX($F:$F,100000),$P6,INDEX($J:$J,11):INDEX($J:$J,100000),\"1_Assigned\")\n+SUMIFS(INDEX(V:V,11):INDEX(V:V,100000),INDEX($F:$F,11):INDEX($F:$F,100000),$P6,INDEX($J:$J,11):INDEX($J:$J,100000),\"2_InProgress\")\n+SUMIFS(INDEX(V:V,11):INDEX(V:V,100000),INDEX($F:$F,11):INDEX($F:$F,100000),$P6,INDEX($J:$J,11):INDEX($J:$J,100000),\"3_Prototype\")\n+SUMIFS(INDEX(V:V,11):INDEX(V:V,100000),INDEX($F:$F,11):INDEX($F:$F,100000),$P6,INDEX($J:$J,11):INDEX($J:$J,100000),\"4_Testing\")","v":0},{"$f":"SUMIFS(INDEX(W:W,11):INDEX(W:W,100000),INDEX($F:$F,11):INDEX($F:$F,100000),$P6,INDEX($J:$J,11):INDEX($J:$J,100000),\"0_AttentionNeeded\")\n+SUMIFS(INDEX(W:W,11):INDEX(W:W,100000),INDEX($F:$F,11):INDEX($F:$F,100000),$P6,INDEX($J:$J,11):INDEX($J:$J,100000),\"1_Assigned\")\n+SUMIFS(INDEX(W:W,11):INDEX(W:W,100000),INDEX($F:$F,11):INDEX($F:$F,100000),$P6,INDEX($J:$J,11):INDEX($J:$J,100000),\"2_InProgress\")\n+SUMIFS(INDEX(W:W,11):INDEX(W:W,100000),INDEX($F:$F,11):INDEX($F:$F,100000),$P6,INDEX($J:$J,11):INDEX($J:$J,100000),\"3_Prototype\")\n+SUMIFS(INDEX(W:W,11):INDEX(W:W,100000),INDEX($F:$F,11):INDEX($F:$F,100000),$P6,INDEX($J:$J,11):INDEX($J:$J,100000),\"4_Testing\")","v":0},0,{"$f":"SUMIFS(INDEX(Y:Y,11):INDEX(Y:Y,100000),INDEX($F:$F,11):INDEX($F:$F,100000),$P6,INDEX($J:$J,11):INDEX($J:$J,100000),\"0_AttentionNeeded\")\n+SUMIFS(INDEX(Y:Y,11):INDEX(Y:Y,100000),INDEX($F:$F,11):INDEX($F:$F,100000),$P6,INDEX($J:$J,11):INDEX($J:$J,100000),\"1_Assigned\")\n+SUMIFS(INDEX(Y:Y,11):INDEX(Y:Y,100000),INDEX($F:$F,11):INDEX($F:$F,100000),$P6,INDEX($J:$J,11):INDEX($J:$J,100000),\"2_InProgress\")\n+SUMIFS(INDEX(Y:Y,11):INDEX(Y:Y,100000),INDEX($F:$F,11):INDEX($F:$F,100000),$P6,INDEX($J:$J,11):INDEX($J:$J,100000),\"3_Prototype\")\n+SUMIFS(INDEX(Y:Y,11):INDEX(Y:Y,100000),INDEX($F:$F,11):INDEX($F:$F,100000),$P6,INDEX($J:$J,11):INDEX($J:$J,100000),\"4_Testing\")","v":0},{"$f":"SUMIFS(INDEX(Z:Z,11):INDEX(Z:Z,100000),INDEX($F:$F,11):INDEX($F:$F,100000),$P6,INDEX($J:$J,11):INDEX($J:$J,100000),\"0_AttentionNeeded\")\n+SUMIFS(INDEX(Z:Z,11):INDEX(Z:Z,100000),INDEX($F:$F,11):INDEX($F:$F,100000),$P6,INDEX($J:$J,11):INDEX($J:$J,100000),\"1_Assigned\")\n+SUMIFS(INDEX(Z:Z,11):INDEX(Z:Z,100000),INDEX($F:$F,11):INDEX($F:$F,100000),$P6,INDEX($J:$J,11):INDEX($J:$J,100000),\"2_InProgress\")\n+SUMIFS(INDEX(Z:Z,11):INDEX(Z:Z,100000),INDEX($F:$F,11):INDEX($F:$F,100000),$P6,INDEX($J:$J,11):INDEX($J:$J,100000),\"3_Prototype\")\n+SUMIFS(INDEX(Z:Z,11):INDEX(Z:Z,100000),INDEX($F:$F,11):INDEX($F:$F,100000),$P6,INDEX($J:$J,11):INDEX($J:$J,100000),\"4_Testing\")","v":0},{"$f":"SUMIFS(INDEX(AA:AA,11):INDEX(AA:AA,100000),INDEX($F:$F,11):INDEX($F:$F,100000),$P6,INDEX($J:$J,11):INDEX($J:$J,100000),\"0_AttentionNeeded\")\n+SUMIFS(INDEX(AA:AA,11):INDEX(AA:AA,100000),INDEX($F:$F,11):INDEX($F:$F,100000),$P6,INDEX($J:$J,11):INDEX($J:$J,100000),\"1_Assigned\")\n+SUMIFS(INDEX(AA:AA,11):INDEX(AA:AA,100000),INDEX($F:$F,11):INDEX($F:$F,100000),$P6,INDEX($J:$J,11):INDEX($J:$J,100000),\"2_InProgress\")\n+SUMIFS(INDEX(AA:AA,11):INDEX(AA:AA,100000),INDEX($F:$F,11):INDEX($F:$F,100000),$P6,INDEX($J:$J,11):INDEX($J:$J,100000),\"3_Prototype\")\n+SUMIFS(INDEX(AA:AA,11):INDEX(AA:AA,100000),INDEX($F:$F,11):INDEX($F:$F,100000),$P6,INDEX($J:$J,11):INDEX($J:$J,100000),\"4_Testing\")","v":0},{"$f":"SUMIFS(INDEX(AB:AB,11):INDEX(AB:AB,100000),INDEX($F:$F,11):INDEX($F:$F,100000),$P6,INDEX($J:$J,11):INDEX($J:$J,100000),\"0_AttentionNeeded\")\n+SUMIFS(INDEX(AB:AB,11):INDEX(AB:AB,100000),INDEX($F:$F,11):INDEX($F:$F,100000),$P6,INDEX($J:$J,11):INDEX($J:$J,100000),\"1_Assigned\")\n+SUMIFS(INDEX(AB:AB,11):INDEX(AB:AB,100000),INDEX($F:$F,11):INDEX($F:$F,100000),$P6,INDEX($J:$J,11):INDEX($J:$J,100000),\"2_InProgress\")\n+SUMIFS(INDEX(AB:AB,11):INDEX(AB:AB,100000),INDEX($F:$F,11):INDEX($F:$F,100000),$P6,INDEX($J:$J,11):INDEX($J:$J,100000),\"3_Prototype\")\n+SUMIFS(INDEX(AB:AB,11):INDEX(AB:AB,100000),INDEX($F:$F,11):INDEX($F:$F,100000),$P6,INDEX($J:$J,11):INDEX($J:$J,100000),\"4_Testing\")","v":0},{"$f":"SUMIFS(INDEX(AC:AC,11):INDEX(AC:AC,100000),INDEX($F:$F,11):INDEX($F:$F,100000),$P6,INDEX($J:$J,11):INDEX($J:$J,100000),\"0_AttentionNeeded\")\n+SUMIFS(INDEX(AC:AC,11):INDEX(AC:AC,100000),INDEX($F:$F,11):INDEX($F:$F,100000),$P6,INDEX($J:$J,11):INDEX($J:$J,100000),\"1_Assigned\")\n+SUMIFS(INDEX(AC:AC,11):INDEX(AC:AC,100000),INDEX($F:$F,11):INDEX($F:$F,100000),$P6,INDEX($J:$J,11):INDEX($J:$J,100000),\"2_InProgress\")\n+SUMIFS(INDEX(AC:AC,11):INDEX(AC:AC,100000),INDEX($F:$F,11):INDEX($F:$F,100000),$P6,INDEX($J:$J,11):INDEX($J:$J,100000),\"3_Prototype\")\n+SUMIFS(INDEX(AC:AC,11):INDEX(AC:AC,100000),INDEX($F:$F,11):INDEX($F:$F,100000),$P6,INDEX($J:$J,11):INDEX($J:$J,100000),\"4_Testing\")","v":0},{"$f":"SUMIFS(INDEX(AD:AD,11):INDEX(AD:AD,100000),INDEX($F:$F,11):INDEX($F:$F,100000),$P6,INDEX($J:$J,11):INDEX($J:$J,100000),\"0_AttentionNeeded\")\n+SUMIFS(INDEX(AD:AD,11):INDEX(AD:AD,100000),INDEX($F:$F,11):INDEX($F:$F,100000),$P6,INDEX($J:$J,11):INDEX($J:$J,100000),\"1_Assigned\")\n+SUMIFS(INDEX(AD:AD,11):INDEX(AD:AD,100000),INDEX($F:$F,11):INDEX($F:$F,100000),$P6,INDEX($J:$J,11):INDEX($J:$J,100000),\"2_InProgress\")\n+SUMIFS(INDEX(AD:AD,11):INDEX(AD:AD,100000),INDEX($F:$F,11):INDEX($F:$F,100000),$P6,INDEX($J:$J,11):INDEX($J:$J,100000),\"3_Prototype\")\n+SUMIFS(INDEX(AD:AD,11):INDEX(AD:AD,100000),INDEX($F:$F,11):INDEX($F:$F,100000),$P6,INDEX($J:$J,11):INDEX($J:$J,100000),\"4_Testing\")","v":0},0,{"$f":"SUMIFS(INDEX(AF:AF,11):INDEX(AF:AF,100000),INDEX($F:$F,11):INDEX($F:$F,100000),$P6,INDEX($J:$J,11):INDEX($J:$J,100000),\"0_AttentionNeeded\")\n+SUMIFS(INDEX(AF:AF,11):INDEX(AF:AF,100000),INDEX($F:$F,11):INDEX($F:$F,100000),$P6,INDEX($J:$J,11):INDEX($J:$J,100000),\"1_Assigned\")\n+SUMIFS(INDEX(AF:AF,11):INDEX(AF:AF,100000),INDEX($F:$F,11):INDEX($F:$F,100000),$P6,INDEX($J:$J,11):INDEX($J:$J,100000),\"2_InProgress\")\n+SUMIFS(INDEX(AF:AF,11):INDEX(AF:AF,100000),INDEX($F:$F,11):INDEX($F:$F,100000),$P6,INDEX($J:$J,11):INDEX($J:$J,100000),\"3_Prototype\")\n+SUMIFS(INDEX(AF:AF,11):INDEX(AF:AF,100000),INDEX($F:$F,11):INDEX($F:$F,100000),$P6,INDEX($J:$J,11):INDEX($J:$J,100000),\"4_Testing\")","v":0},{"$f":"SUMIFS(INDEX(AG:AG,11):INDEX(AG:AG,100000),INDEX($F:$F,11):INDEX($F:$F,100000),$P6,INDEX($J:$J,11):INDEX($J:$J,100000),\"0_AttentionNeeded\")\n+SUMIFS(INDEX(AG:AG,11):INDEX(AG:AG,100000),INDEX($F:$F,11):INDEX($F:$F,100000),$P6,INDEX($J:$J,11):INDEX($J:$J,100000),\"1_Assigned\")\n+SUMIFS(INDEX(AG:AG,11):INDEX(AG:AG,100000),INDEX($F:$F,11):INDEX($F:$F,100000),$P6,INDEX($J:$J,11):INDEX($J:$J,100000),\"2_InProgress\")\n+SUMIFS(INDEX(AG:AG,11):INDEX(AG:AG,100000),INDEX($F:$F,11):INDEX($F:$F,100000),$P6,INDEX($J:$J,11):INDEX($J:$J,100000),\"3_Prototype\")\n+SUMIFS(INDEX(AG:AG,11):INDEX(AG:AG,100000),INDEX($F:$F,11):INDEX($F:$F,100000),$P6,INDEX($J:$J,11):INDEX($J:$J,100000),\"4_Testing\")","v":0},{"$f":"SUMIFS(INDEX(AH:AH,11):INDEX(AH:AH,100000),INDEX($F:$F,11):INDEX($F:$F,100000),$P6,INDEX($J:$J,11):INDEX($J:$J,100000),\"0_AttentionNeeded\")\n+SUMIFS(INDEX(AH:AH,11):INDEX(AH:AH,100000),INDEX($F:$F,11):INDEX($F:$F,100000),$P6,INDEX($J:$J,11):INDEX($J:$J,100000),\"1_Assigned\")\n+SUMIFS(INDEX(AH:AH,11):INDEX(AH:AH,100000),INDEX($F:$F,11):INDEX($F:$F,100000),$P6,INDEX($J:$J,11):INDEX($J:$J,100000),\"2_InProgress\")\n+SUMIFS(INDEX(AH:AH,11):INDEX(AH:AH,100000),INDEX($F:$F,11):INDEX($F:$F,100000),$P6,INDEX($J:$J,11):INDEX($J:$J,100000),\"3_Prototype\")\n+SUMIFS(INDEX(AH:AH,11):INDEX(AH:AH,100000),INDEX($F:$F,11):INDEX($F:$F,100000),$P6,INDEX($J:$J,11):INDEX($J:$J,100000),\"4_Testing\")","v":0},{"$f":"SUMIFS(INDEX(AI:AI,11):INDEX(AI:AI,100000),INDEX($F:$F,11):INDEX($F:$F,100000),$P6,INDEX($J:$J,11):INDEX($J:$J,100000),\"0_AttentionNeeded\")\n+SUMIFS(INDEX(AI:AI,11):INDEX(AI:AI,100000),INDEX($F:$F,11):INDEX($F:$F,100000),$P6,INDEX($J:$J,11):INDEX($J:$J,100000),\"1_Assigned\")\n+SUMIFS(INDEX(AI:AI,11):INDEX(AI:AI,100000),INDEX($F:$F,11):INDEX($F:$F,100000),$P6,INDEX($J:$J,11):INDEX($J:$J,100000),\"2_InProgress\")\n+SUMIFS(INDEX(AI:AI,11):INDEX(AI:AI,100000),INDEX($F:$F,11):INDEX($F:$F,100000),$P6,INDEX($J:$J,11):INDEX($J:$J,100000),\"3_Prototype\")\n+SUMIFS(INDEX(AI:AI,11):INDEX(AI:AI,100000),INDEX($F:$F,11):INDEX($F:$F,100000),$P6,INDEX($J:$J,11):INDEX($J:$J,100000),\"4_Testing\")","v":0},{"$f":"SUMIFS(INDEX(AJ:AJ,11):INDEX(AJ:AJ,100000),INDEX($F:$F,11):INDEX($F:$F,100000),$P6,INDEX($J:$J,11):INDEX($J:$J,100000),\"0_AttentionNeeded\")\n+SUMIFS(INDEX(AJ:AJ,11):INDEX(AJ:AJ,100000),INDEX($F:$F,11):INDEX($F:$F,100000),$P6,INDEX($J:$J,11):INDEX($J:$J,100000),\"1_Assigned\")\n+SUMIFS(INDEX(AJ:AJ,11):INDEX(AJ:AJ,100000),INDEX($F:$F,11):INDEX($F:$F,100000),$P6,INDEX($J:$J,11):INDEX($J:$J,100000),\"2_InProgress\")\n+SUMIFS(INDEX(AJ:AJ,11):INDEX(AJ:AJ,100000),INDEX($F:$F,11):INDEX($F:$F,100000),$P6,INDEX($J:$J,11):INDEX($J:$J,100000),\"3_Prototype\")\n+SUMIFS(INDEX(AJ:AJ,11):INDEX(AJ:AJ,100000),INDEX($F:$F,11):INDEX($F:$F,100000),$P6,INDEX($J:$J,11):INDEX($J:$J,100000),\"4_Testing\")","v":0},{"$f":"SUMIFS(INDEX(AK:AK,11):INDEX(AK:AK,100000),INDEX($F:$F,11):INDEX($F:$F,100000),$P6,INDEX($J:$J,11):INDEX($J:$J,100000),\"0_AttentionNeeded\")\n+SUMIFS(INDEX(AK:AK,11):INDEX(AK:AK,100000),INDEX($F:$F,11):INDEX($F:$F,100000),$P6,INDEX($J:$J,11):INDEX($J:$J,100000),\"1_Assigned\")\n+SUMIFS(INDEX(AK:AK,11):INDEX(AK:AK,100000),INDEX($F:$F,11):INDEX($F:$F,100000),$P6,INDEX($J:$J,11):INDEX($J:$J,100000),\"2_InProgress\")\n+SUMIFS(INDEX(AK:AK,11):INDEX(AK:AK,100000),INDEX($F:$F,11):INDEX($F:$F,100000),$P6,INDEX($J:$J,11):INDEX($J:$J,100000),\"3_Prototype\")\n+SUMIFS(INDEX(AK:AK,11):INDEX(AK:AK,100000),INDEX($F:$F,11):INDEX($F:$F,100000),$P6,INDEX($J:$J,11):INDEX($J:$J,100000),\"4_Testing\")","v":0},0,{"$f":"SUMIFS(INDEX(AM:AM,11):INDEX(AM:AM,100000),INDEX($F:$F,11):INDEX($F:$F,100000),$P6,INDEX($J:$J,11):INDEX($J:$J,100000),\"0_AttentionNeeded\")\n+SUMIFS(INDEX(AM:AM,11):INDEX(AM:AM,100000),INDEX($F:$F,11):INDEX($F:$F,100000),$P6,INDEX($J:$J,11):INDEX($J:$J,100000),\"1_Assigned\")\n+SUMIFS(INDEX(AM:AM,11):INDEX(AM:AM,100000),INDEX($F:$F,11):INDEX($F:$F,100000),$P6,INDEX($J:$J,11):INDEX($J:$J,100000),\"2_InProgress\")\n+SUMIFS(INDEX(AM:AM,11):INDEX(AM:AM,100000),INDEX($F:$F,11):INDEX($F:$F,100000),$P6,INDEX($J:$J,11):INDEX($J:$J,100000),\"3_Prototype\")\n+SUMIFS(INDEX(AM:AM,11):INDEX(AM:AM,100000),INDEX($F:$F,11):INDEX($F:$F,100000),$P6,INDEX($J:$J,11):INDEX($J:$J,100000),\"4_Testing\")","v":0},{"$f":"SUMIFS(INDEX(AN:AN,11):INDEX(AN:AN,100000),INDEX($F:$F,11):INDEX($F:$F,100000),$P6,INDEX($J:$J,11):INDEX($J:$J,100000),\"0_AttentionNeeded\")\n+SUMIFS(INDEX(AN:AN,11):INDEX(AN:AN,100000),INDEX($F:$F,11):INDEX($F:$F,100000),$P6,INDEX($J:$J,11):INDEX($J:$J,100000),\"1_Assigned\")\n+SUMIFS(INDEX(AN:AN,11):INDEX(AN:AN,100000),INDEX($F:$F,11):INDEX($F:$F,100000),$P6,INDEX($J:$J,11):INDEX($J:$J,100000),\"2_InProgress\")\n+SUMIFS(INDEX(AN:AN,11):INDEX(AN:AN,100000),INDEX($F:$F,11):INDEX($F:$F,100000),$P6,INDEX($J:$J,11):INDEX($J:$J,100000),\"3_Prototype\")\n+SUMIFS(INDEX(AN:AN,11):INDEX(AN:AN,100000),INDEX($F:$F,11):INDEX($F:$F,100000),$P6,INDEX($J:$J,11):INDEX($J:$J,100000),\"4_Testing\")","v":0},{"$f":"SUMIFS(INDEX(AO:AO,11):INDEX(AO:AO,100000),INDEX($F:$F,11):INDEX($F:$F,100000),$P6,INDEX($J:$J,11):INDEX($J:$J,100000),\"0_AttentionNeeded\")\n+SUMIFS(INDEX(AO:AO,11):INDEX(AO:AO,100000),INDEX($F:$F,11):INDEX($F:$F,100000),$P6,INDEX($J:$J,11):INDEX($J:$J,100000),\"1_Assigned\")\n+SUMIFS(INDEX(AO:AO,11):INDEX(AO:AO,100000),INDEX($F:$F,11):INDEX($F:$F,100000),$P6,INDEX($J:$J,11):INDEX($J:$J,100000),\"2_InProgress\")\n+SUMIFS(INDEX(AO:AO,11):INDEX(AO:AO,100000),INDEX($F:$F,11):INDEX($F:$F,100000),$P6,INDEX($J:$J,11):INDEX($J:$J,100000),\"3_Prototype\")\n+SUMIFS(INDEX(AO:AO,11):INDEX(AO:AO,100000),INDEX($F:$F,11):INDEX($F:$F,100000),$P6,INDEX($J:$J,11):INDEX($J:$J,100000),\"4_Testing\")","v":0},{"$f":"SUMIFS(INDEX(AP:AP,11):INDEX(AP:AP,100000),INDEX($F:$F,11):INDEX($F:$F,100000),$P6,INDEX($J:$J,11):INDEX($J:$J,100000),\"0_AttentionNeeded\")\n+SUMIFS(INDEX(AP:AP,11):INDEX(AP:AP,100000),INDEX($F:$F,11):INDEX($F:$F,100000),$P6,INDEX($J:$J,11):INDEX($J:$J,100000),\"1_Assigned\")\n+SUMIFS(INDEX(AP:AP,11):INDEX(AP:AP,100000),INDEX($F:$F,11):INDEX($F:$F,100000),$P6,INDEX($J:$J,11):INDEX($J:$J,100000),\"2_InProgress\")\n+SUMIFS(INDEX(AP:AP,11):INDEX(AP:AP,100000),INDEX($F:$F,11):INDEX($F:$F,100000),$P6,INDEX($J:$J,11):INDEX($J:$J,100000),\"3_Prototype\")\n+SUMIFS(INDEX(AP:AP,11):INDEX(AP:AP,100000),INDEX($F:$F,11):INDEX($F:$F,100000),$P6,INDEX($J:$J,11):INDEX($J:$J,100000),\"4_Testing\")","v":0},{"$f":"SUMIFS(INDEX(AQ:AQ,11):INDEX(AQ:AQ,100000),INDEX($F:$F,11):INDEX($F:$F,100000),$P6,INDEX($J:$J,11):INDEX($J:$J,100000),\"0_AttentionNeeded\")\n+SUMIFS(INDEX(AQ:AQ,11):INDEX(AQ:AQ,100000),INDEX($F:$F,11):INDEX($F:$F,100000),$P6,INDEX($J:$J,11):INDEX($J:$J,100000),\"1_Assigned\")\n+SUMIFS(INDEX(AQ:AQ,11):INDEX(AQ:AQ,100000),INDEX($F:$F,11):INDEX($F:$F,100000),$P6,INDEX($J:$J,11):INDEX($J:$J,100000),\"2_InProgress\")\n+SUMIFS(INDEX(AQ:AQ,11):INDEX(AQ:AQ,100000),INDEX($F:$F,11):INDEX($F:$F,100000),$P6,INDEX($J:$J,11):INDEX($J:$J,100000),\"3_Prototype\")\n+SUMIFS(INDEX(AQ:AQ,11):INDEX(AQ:AQ,100000),INDEX($F:$F,11):INDEX($F:$F,100000),$P6,INDEX($J:$J,11):INDEX($J:$J,100000),\"4_Testing\")","v":0},{"$f":"SUMIFS(INDEX(AR:AR,11):INDEX(AR:AR,100000),INDEX($F:$F,11):INDEX($F:$F,100000),$P6,INDEX($J:$J,11):INDEX($J:$J,100000),\"0_AttentionNeeded\")\n+SUMIFS(INDEX(AR:AR,11):INDEX(AR:AR,100000),INDEX($F:$F,11):INDEX($F:$F,100000),$P6,INDEX($J:$J,11):INDEX($J:$J,100000),\"1_Assigned\")\n+SUMIFS(INDEX(AR:AR,11):INDEX(AR:AR,100000),INDEX($F:$F,11):INDEX($F:$F,100000),$P6,INDEX($J:$J,11):INDEX($J:$J,100000),\"2_InProgress\")\n+SUMIFS(INDEX(AR:AR,11):INDEX(AR:AR,100000),INDEX($F:$F,11):INDEX($F:$F,100000),$P6,INDEX($J:$J,11):INDEX($J:$J,100000),\"3_Prototype\")\n+SUMIFS(INDEX(AR:AR,11):INDEX(AR:AR,100000),INDEX($F:$F,11):INDEX($F:$F,100000),$P6,INDEX($J:$J,11):INDEX($J:$J,100000),\"4_Testing\")","v":0},0,{"$f":"SUMIFS(INDEX(AT:AT,11):INDEX(AT:AT,100000),INDEX($F:$F,11):INDEX($F:$F,100000),$P6,INDEX($J:$J,11):INDEX($J:$J,100000),\"0_AttentionNeeded\")\n+SUMIFS(INDEX(AT:AT,11):INDEX(AT:AT,100000),INDEX($F:$F,11):INDEX($F:$F,100000),$P6,INDEX($J:$J,11):INDEX($J:$J,100000),\"1_Assigned\")\n+SUMIFS(INDEX(AT:AT,11):INDEX(AT:AT,100000),INDEX($F:$F,11):INDEX($F:$F,100000),$P6,INDEX($J:$J,11):INDEX($J:$J,100000),\"2_InProgress\")\n+SUMIFS(INDEX(AT:AT,11):INDEX(AT:AT,100000),INDEX($F:$F,11):INDEX($F:$F,100000),$P6,INDEX($J:$J,11):INDEX($J:$J,100000),\"3_Prototype\")\n+SUMIFS(INDEX(AT:AT,11):INDEX(AT:AT,100000),INDEX($F:$F,11):INDEX($F:$F,100000),$P6,INDEX($J:$J,11):INDEX($J:$J,100000),\"4_Testing\")","v":0},{"$f":"SUMIFS(INDEX(AU:AU,11):INDEX(AU:AU,100000),INDEX($F:$F,11):INDEX($F:$F,100000),$P6,INDEX($J:$J,11):INDEX($J:$J,100000),\"0_AttentionNeeded\")\n+SUMIFS(INDEX(AU:AU,11):INDEX(AU:AU,100000),INDEX($F:$F,11):INDEX($F:$F,100000),$P6,INDEX($J:$J,11):INDEX($J:$J,100000),\"1_Assigned\")\n+SUMIFS(INDEX(AU:AU,11):INDEX(AU:AU,100000),INDEX($F:$F,11):INDEX($F:$F,100000),$P6,INDEX($J:$J,11):INDEX($J:$J,100000),\"2_InProgress\")\n+SUMIFS(INDEX(AU:AU,11):INDEX(AU:AU,100000),INDEX($F:$F,11):INDEX($F:$F,100000),$P6,INDEX($J:$J,11):INDEX($J:$J,100000),\"3_Prototype\")\n+SUMIFS(INDEX(AU:AU,11):INDEX(AU:AU,100000),INDEX($F:$F,11):INDEX($F:$F,100000),$P6,INDEX($J:$J,11):INDEX($J:$J,100000),\"4_Testing\")","v":0},{"$f":"SUMIFS(INDEX(AV:AV,11):INDEX(AV:AV,100000),INDEX($F:$F,11):INDEX($F:$F,100000),$P6,INDEX($J:$J,11):INDEX($J:$J,100000),\"0_AttentionNeeded\")\n+SUMIFS(INDEX(AV:AV,11):INDEX(AV:AV,100000),INDEX($F:$F,11):INDEX($F:$F,100000),$P6,INDEX($J:$J,11):INDEX($J:$J,100000),\"1_Assigned\")\n+SUMIFS(INDEX(AV:AV,11):INDEX(AV:AV,100000),INDEX($F:$F,11):INDEX($F:$F,100000),$P6,INDEX($J:$J,11):INDEX($J:$J,100000),\"2_InProgress\")\n+SUMIFS(INDEX(AV:AV,11):INDEX(AV:AV,100000),INDEX($F:$F,11):INDEX($F:$F,100000),$P6,INDEX($J:$J,11):INDEX($J:$J,100000),\"3_Prototype\")\n+SUMIFS(INDEX(AV:AV,11):INDEX(AV:AV,100000),INDEX($F:$F,11):INDEX($F:$F,100000),$P6,INDEX($J:$J,11):INDEX($J:$J,100000),\"4_Testing\")","v":0},{"$f":"SUMIFS(INDEX(AW:AW,11):INDEX(AW:AW,100000),INDEX($F:$F,11):INDEX($F:$F,100000),$P6,INDEX($J:$J,11):INDEX($J:$J,100000),\"0_AttentionNeeded\")\n+SUMIFS(INDEX(AW:AW,11):INDEX(AW:AW,100000),INDEX($F:$F,11):INDEX($F:$F,100000),$P6,INDEX($J:$J,11):INDEX($J:$J,100000),\"1_Assigned\")\n+SUMIFS(INDEX(AW:AW,11):INDEX(AW:AW,100000),INDEX($F:$F,11):INDEX($F:$F,100000),$P6,INDEX($J:$J,11):INDEX($J:$J,100000),\"2_InProgress\")\n+SUMIFS(INDEX(AW:AW,11):INDEX(AW:AW,100000),INDEX($F:$F,11):INDEX($F:$F,100000),$P6,INDEX($J:$J,11):INDEX($J:$J,100000),\"3_Prototype\")\n+SUMIFS(INDEX(AW:AW,11):INDEX(AW:AW,100000),INDEX($F:$F,11):INDEX($F:$F,100000),$P6,INDEX($J:$J,11):INDEX($J:$J,100000),\"4_Testing\")","v":0},{"$f":"SUMIFS(INDEX(AX:AX,11):INDEX(AX:AX,100000),INDEX($F:$F,11):INDEX($F:$F,100000),$P6,INDEX($J:$J,11):INDEX($J:$J,100000),\"0_AttentionNeeded\")\n+SUMIFS(INDEX(AX:AX,11):INDEX(AX:AX,100000),INDEX($F:$F,11):INDEX($F:$F,100000),$P6,INDEX($J:$J,11):INDEX($J:$J,100000),\"1_Assigned\")\n+SUMIFS(INDEX(AX:AX,11):INDEX(AX:AX,100000),INDEX($F:$F,11):INDEX($F:$F,100000),$P6,INDEX($J:$J,11):INDEX($J:$J,100000),\"2_InProgress\")\n+SUMIFS(INDEX(AX:AX,11):INDEX(AX:AX,100000),INDEX($F:$F,11):INDEX($F:$F,100000),$P6,INDEX($J:$J,11):INDEX($J:$J,100000),\"3_Prototype\")\n+SUMIFS(INDEX(AX:AX,11):INDEX(AX:AX,100000),INDEX($F:$F,11):INDEX($F:$F,100000),$P6,INDEX($J:$J,11):INDEX($J:$J,100000),\"4_Testing\")","v":0},{"$f":"SUMIFS(INDEX(AY:AY,11):INDEX(AY:AY,100000),INDEX($F:$F,11):INDEX($F:$F,100000),$P6,INDEX($J:$J,11):INDEX($J:$J,100000),\"0_AttentionNeeded\")\n+SUMIFS(INDEX(AY:AY,11):INDEX(AY:AY,100000),INDEX($F:$F,11):INDEX($F:$F,100000),$P6,INDEX($J:$J,11):INDEX($J:$J,100000),\"1_Assigned\")\n+SUMIFS(INDEX(AY:AY,11):INDEX(AY:AY,100000),INDEX($F:$F,11):INDEX($F:$F,100000),$P6,INDEX($J:$J,11):INDEX($J:$J,100000),\"2_InProgress\")\n+SUMIFS(INDEX(AY:AY,11):INDEX(AY:AY,100000),INDEX($F:$F,11):INDEX($F:$F,100000),$P6,INDEX($J:$J,11):INDEX($J:$J,100000),\"3_Prototype\")\n+SUMIFS(INDEX(AY:AY,11):INDEX(AY:AY,100000),INDEX($F:$F,11):INDEX($F:$F,100000),$P6,INDEX($J:$J,11):INDEX($J:$J,100000),\"4_Testing\")","v":0},0,{"$f":"SUMIFS(INDEX(BA:BA,11):INDEX(BA:BA,100000),INDEX($F:$F,11):INDEX($F:$F,100000),$P6,INDEX($J:$J,11):INDEX($J:$J,100000),\"0_AttentionNeeded\")\n+SUMIFS(INDEX(BA:BA,11):INDEX(BA:BA,100000),INDEX($F:$F,11):INDEX($F:$F,100000),$P6,INDEX($J:$J,11):INDEX($J:$J,100000),\"1_Assigned\")\n+SUMIFS(INDEX(BA:BA,11):INDEX(BA:BA,100000),INDEX($F:$F,11):INDEX($F:$F,100000),$P6,INDEX($J:$J,11):INDEX($J:$J,100000),\"2_InProgress\")\n+SUMIFS(INDEX(BA:BA,11):INDEX(BA:BA,100000),INDEX($F:$F,11):INDEX($F:$F,100000),$P6,INDEX($J:$J,11):INDEX($J:$J,100000),\"3_Prototype\")\n+SUMIFS(INDEX(BA:BA,11):INDEX(BA:BA,100000),INDEX($F:$F,11):INDEX($F:$F,100000),$P6,INDEX($J:$J,11):INDEX($J:$J,100000),\"4_Testing\")","v":0},{"$f":"SUMIFS(INDEX(BB:BB,11):INDEX(BB:BB,100000),INDEX($F:$F,11):INDEX($F:$F,100000),$P6,INDEX($J:$J,11):INDEX($J:$J,100000),\"0_AttentionNeeded\")\n+SUMIFS(INDEX(BB:BB,11):INDEX(BB:BB,100000),INDEX($F:$F,11):INDEX($F:$F,100000),$P6,INDEX($J:$J,11):INDEX($J:$J,100000),\"1_Assigned\")\n+SUMIFS(INDEX(BB:BB,11):INDEX(BB:BB,100000),INDEX($F:$F,11):INDEX($F:$F,100000),$P6,INDEX($J:$J,11):INDEX($J:$J,100000),\"2_InProgress\")\n+SUMIFS(INDEX(BB:BB,11):INDEX(BB:BB,100000),INDEX($F:$F,11):INDEX($F:$F,100000),$P6,INDEX($J:$J,11):INDEX($J:$J,100000),\"3_Prototype\")\n+SUMIFS(INDEX(BB:BB,11):INDEX(BB:BB,100000),INDEX($F:$F,11):INDEX($F:$F,100000),$P6,INDEX($J:$J,11):INDEX($J:$J,100000),\"4_Testing\")","v":0},{"$f":"SUMIFS(INDEX(BC:BC,11):INDEX(BC:BC,100000),INDEX($F:$F,11):INDEX($F:$F,100000),$P6,INDEX($J:$J,11):INDEX($J:$J,100000),\"0_AttentionNeeded\")\n+SUMIFS(INDEX(BC:BC,11):INDEX(BC:BC,100000),INDEX($F:$F,11):INDEX($F:$F,100000),$P6,INDEX($J:$J,11):INDEX($J:$J,100000),\"1_Assigned\")\n+SUMIFS(INDEX(BC:BC,11):INDEX(BC:BC,100000),INDEX($F:$F,11):INDEX($F:$F,100000),$P6,INDEX($J:$J,11):INDEX($J:$J,100000),\"2_InProgress\")\n+SUMIFS(INDEX(BC:BC,11):INDEX(BC:BC,100000),INDEX($F:$F,11):INDEX($F:$F,100000),$P6,INDEX($J:$J,11):INDEX($J:$J,100000),\"3_Prototype\")\n+SUMIFS(INDEX(BC:BC,11):INDEX(BC:BC,100000),INDEX($F:$F,11):INDEX($F:$F,100000),$P6,INDEX($J:$J,11):INDEX($J:$J,100000),\"4_Testing\")","v":0},{"$f":"SUMIFS(INDEX(BD:BD,11):INDEX(BD:BD,100000),INDEX($F:$F,11):INDEX($F:$F,100000),$P6,INDEX($J:$J,11):INDEX($J:$J,100000),\"0_AttentionNeeded\")\n+SUMIFS(INDEX(BD:BD,11):INDEX(BD:BD,100000),INDEX($F:$F,11):INDEX($F:$F,100000),$P6,INDEX($J:$J,11):INDEX($J:$J,100000),\"1_Assigned\")\n+SUMIFS(INDEX(BD:BD,11):INDEX(BD:BD,100000),INDEX($F:$F,11):INDEX($F:$F,100000),$P6,INDEX($J:$J,11):INDEX($J:$J,100000),\"2_InProgress\")\n+SUMIFS(INDEX(BD:BD,11):INDEX(BD:BD,100000),INDEX($F:$F,11):INDEX($F:$F,100000),$P6,INDEX($J:$J,11):INDEX($J:$J,100000),\"3_Prototype\")\n+SUMIFS(INDEX(BD:BD,11):INDEX(BD:BD,100000),INDEX($F:$F,11):INDEX($F:$F,100000),$P6,INDEX($J:$J,11):INDEX($J:$J,100000),\"4_Testing\")","v":0},{"$f":"SUMIFS(INDEX(BE:BE,11):INDEX(BE:BE,100000),INDEX($F:$F,11):INDEX($F:$F,100000),$P6,INDEX($J:$J,11):INDEX($J:$J,100000),\"0_AttentionNeeded\")\n+SUMIFS(INDEX(BE:BE,11):INDEX(BE:BE,100000),INDEX($F:$F,11):INDEX($F:$F,100000),$P6,INDEX($J:$J,11):INDEX($J:$J,100000),\"1_Assigned\")\n+SUMIFS(INDEX(BE:BE,11):INDEX(BE:BE,100000),INDEX($F:$F,11):INDEX($F:$F,100000),$P6,INDEX($J:$J,11):INDEX($J:$J,100000),\"2_InProgress\")\n+SUMIFS(INDEX(BE:BE,11):INDEX(BE:BE,100000),INDEX($F:$F,11):INDEX($F:$F,100000),$P6,INDEX($J:$J,11):INDEX($J:$J,100000),\"3_Prototype\")\n+SUMIFS(INDEX(BE:BE,11):INDEX(BE:BE,100000),INDEX($F:$F,11):INDEX($F:$F,100000),$P6,INDEX($J:$J,11):INDEX($J:$J,100000),\"4_Testing\")","v":0},{"$f":"SUMIFS(INDEX(BF:BF,11):INDEX(BF:BF,100000),INDEX($F:$F,11):INDEX($F:$F,100000),$P6,INDEX($J:$J,11):INDEX($J:$J,100000),\"0_AttentionNeeded\")\n+SUMIFS(INDEX(BF:BF,11):INDEX(BF:BF,100000),INDEX($F:$F,11):INDEX($F:$F,100000),$P6,INDEX($J:$J,11):INDEX($J:$J,100000),\"1_Assigned\")\n+SUMIFS(INDEX(BF:BF,11):INDEX(BF:BF,100000),INDEX($F:$F,11):INDEX($F:$F,100000),$P6,INDEX($J:$J,11):INDEX($J:$J,100000),\"2_InProgress\")\n+SUMIFS(INDEX(BF:BF,11):INDEX(BF:BF,100000),INDEX($F:$F,11):INDEX($F:$F,100000),$P6,INDEX($J:$J,11):INDEX($J:$J,100000),\"3_Prototype\")\n+SUMIFS(INDEX(BF:BF,11):INDEX(BF:BF,100000),INDEX($F:$F,11):INDEX($F:$F,100000),$P6,INDEX($J:$J,11):INDEX($J:$J,100000),\"4_Testing\")","v":0}]
["Updated 2023-07-17 08:25:20",null,null,null,null,null,null,null,null,null,null,null,null,null,null,"N4",0,{"$f":"SUMIFS(INDEX(R:R,11):INDEX(R:R,100000),INDEX($F:$F,11):INDEX($F:$F,100000),$P7,INDEX($J:$J,11):INDEX($J:$J,100000),\"0_AttentionNeeded\")\n+SUMIFS(INDEX(R:R,11):INDEX(R:R,100000),INDEX($F:$F,11):INDEX($F:$F,100000),$P7,INDEX($J:$J,11):INDEX($J:$J,100000),\"1_Assigned\")\n+SUMIFS(INDEX(R:R,11):INDEX(R:R,100000),INDEX($F:$F,11):INDEX($F:$F,100000),$P7,INDEX($J:$J,11):INDEX($J:$J,100000),\"2_InProgress\")\n+SUMIFS(INDEX(R:R,11):INDEX(R:R,100000),INDEX($F:$F,11):INDEX($F:$F,100000),$P7,INDEX($J:$J,11):INDEX($J:$J,100000),\"3_Prototype\")\n+SUMIFS(INDEX(R:R,11):INDEX(R:R,100000),INDEX($F:$F,11):INDEX($F:$F,100000),$P7,INDEX($J:$J,11):INDEX($J:$J,100000),\"4_Testing\")","v":0},{"$f":"SUMIFS(INDEX(S:S,11):INDEX(S:S,100000),INDEX($F:$F,11):INDEX($F:$F,100000),$P7,INDEX($J:$J,11):INDEX($J:$J,100000),\"0_AttentionNeeded\")\n+SUMIFS(INDEX(S:S,11):INDEX(S:S,100000),INDEX($F:$F,11):INDEX($F:$F,100000),$P7,INDEX($J:$J,11):INDEX($J:$J,100000),\"1_Assigned\")\n+SUMIFS(INDEX(S:S,11):INDEX(S:S,100000),INDEX($F:$F,11):INDEX($F:$F,100000),$P7,INDEX($J:$J,11):INDEX($J:$J,100000),\"2_InProgress\")\n+SUMIFS(INDEX(S:S,11):INDEX(S:S,100000),INDEX($F:$F,11):INDEX($F:$F,100000),$P7,INDEX($J:$J,11):INDEX($J:$J,100000),\"3_Prototype\")\n+SUMIFS(INDEX(S:S,11):INDEX(S:S,100000),INDEX($F:$F,11):INDEX($F:$F,100000),$P7,INDEX($J:$J,11):INDEX($J:$J,100000),\"4_Testing\")","v":0},{"$f":"SUMIFS(INDEX(T:T,11):INDEX(T:T,100000),INDEX($F:$F,11):INDEX($F:$F,100000),$P7,INDEX($J:$J,11):INDEX($J:$J,100000),\"0_AttentionNeeded\")\n+SUMIFS(INDEX(T:T,11):INDEX(T:T,100000),INDEX($F:$F,11):INDEX($F:$F,100000),$P7,INDEX($J:$J,11):INDEX($J:$J,100000),\"1_Assigned\")\n+SUMIFS(INDEX(T:T,11):INDEX(T:T,100000),INDEX($F:$F,11):INDEX($F:$F,100000),$P7,INDEX($J:$J,11):INDEX($J:$J,100000),\"2_InProgress\")\n+SUMIFS(INDEX(T:T,11):INDEX(T:T,100000),INDEX($F:$F,11):INDEX($F:$F,100000),$P7,INDEX($J:$J,11):INDEX($J:$J,100000),\"3_Prototype\")\n+SUMIFS(INDEX(T:T,11):INDEX(T:T,100000),INDEX($F:$F,11):INDEX($F:$F,100000),$P7,INDEX($J:$J,11):INDEX($J:$J,100000),\"4_Testing\")","v":0},{"$f":"SUMIFS(INDEX(U:U,11):INDEX(U:U,100000),INDEX($F:$F,11):INDEX($F:$F,100000),$P7,INDEX($J:$J,11):INDEX($J:$J,100000),\"0_AttentionNeeded\")\n+SUMIFS(INDEX(U:U,11):INDEX(U:U,100000),INDEX($F:$F,11):INDEX($F:$F,100000),$P7,INDEX($J:$J,11):INDEX($J:$J,100000),\"1_Assigned\")\n+SUMIFS(INDEX(U:U,11):INDEX(U:U,100000),INDEX($F:$F,11):INDEX($F:$F,100000),$P7,INDEX($J:$J,11):INDEX($J:$J,100000),\"2_InProgress\")\n+SUMIFS(INDEX(U:U,11):INDEX(U:U,100000),INDEX($F:$F,11):INDEX($F:$F,100000),$P7,INDEX($J:$J,11):INDEX($J:$J,100000),\"3_Prototype\")\n+SUMIFS(INDEX(U:U,11):INDEX(U:U,100000),INDEX($F:$F,11):INDEX($F:$F,100000),$P7,INDEX($J:$J,11):INDEX($J:$J,100000),\"4_Testing\")","v":0},{"$f":"SUMIFS(INDEX(V:V,11):INDEX(V:V,100000),INDEX($F:$F,11):INDEX($F:$F,100000),$P7,INDEX($J:$J,11):INDEX($J:$J,100000),\"0_AttentionNeeded\")\n+SUMIFS(INDEX(V:V,11):INDEX(V:V,100000),INDEX($F:$F,11):INDEX($F:$F,100000),$P7,INDEX($J:$J,11):INDEX($J:$J,100000),\"1_Assigned\")\n+SUMIFS(INDEX(V:V,11):INDEX(V:V,100000),INDEX($F:$F,11):INDEX($F:$F,100000),$P7,INDEX($J:$J,11):INDEX($J:$J,100000),\"2_InProgress\")\n+SUMIFS(INDEX(V:V,11):INDEX(V:V,100000),INDEX($F:$F,11):INDEX($F:$F,100000),$P7,INDEX($J:$J,11):INDEX($J:$J,100000),\"3_Prototype\")\n+SUMIFS(INDEX(V:V,11):INDEX(V:V,100000),INDEX($F:$F,11):INDEX($F:$F,100000),$P7,INDEX($J:$J,11):INDEX($J:$J,100000),\"4_Testing\")","v":0},{"$f":"SUMIFS(INDEX(W:W,11):INDEX(W:W,100000),INDEX($F:$F,11):INDEX($F:$F,100000),$P7,INDEX($J:$J,11):INDEX($J:$J,100000),\"0_AttentionNeeded\")\n+SUMIFS(INDEX(W:W,11):INDEX(W:W,100000),INDEX($F:$F,11):INDEX($F:$F,100000),$P7,INDEX($J:$J,11):INDEX($J:$J,100000),\"1_Assigned\")\n+SUMIFS(INDEX(W:W,11):INDEX(W:W,100000),INDEX($F:$F,11):INDEX($F:$F,100000),$P7,INDEX($J:$J,11):INDEX($J:$J,100000),\"2_InProgress\")\n+SUMIFS(INDEX(W:W,11):INDEX(W:W,100000),INDEX($F:$F,11):INDEX($F:$F,100000),$P7,INDEX($J:$J,11):INDEX($J:$J,100000),\"3_Prototype\")\n+SUMIFS(INDEX(W:W,11):INDEX(W:W,100000),INDEX($F:$F,11):INDEX($F:$F,100000),$P7,INDEX($J:$J,11):INDEX($J:$J,100000),\"4_Testing\")","v":0},0,{"$f":"SUMIFS(INDEX(Y:Y,11):INDEX(Y:Y,100000),INDEX($F:$F,11):INDEX($F:$F,100000),$P7,INDEX($J:$J,11):INDEX($J:$J,100000),\"0_AttentionNeeded\")\n+SUMIFS(INDEX(Y:Y,11):INDEX(Y:Y,100000),INDEX($F:$F,11):INDEX($F:$F,100000),$P7,INDEX($J:$J,11):INDEX($J:$J,100000),\"1_Assigned\")\n+SUMIFS(INDEX(Y:Y,11):INDEX(Y:Y,100000),INDEX($F:$F,11):INDEX($F:$F,100000),$P7,INDEX($J:$J,11):INDEX($J:$J,100000),\"2_InProgress\")\n+SUMIFS(INDEX(Y:Y,11):INDEX(Y:Y,100000),INDEX($F:$F,11):INDEX($F:$F,100000),$P7,INDEX($J:$J,11):INDEX($J:$J,100000),\"3_Prototype\")\n+SUMIFS(INDEX(Y:Y,11):INDEX(Y:Y,100000),INDEX($F:$F,11):INDEX($F:$F,100000),$P7,INDEX($J:$J,11):INDEX($J:$J,100000),\"4_Testing\")","v":0},{"$f":"SUMIFS(INDEX(Z:Z,11):INDEX(Z:Z,100000),INDEX($F:$F,11):INDEX($F:$F,100000),$P7,INDEX($J:$J,11):INDEX($J:$J,100000),\"0_AttentionNeeded\")\n+SUMIFS(INDEX(Z:Z,11):INDEX(Z:Z,100000),INDEX($F:$F,11):INDEX($F:$F,100000),$P7,INDEX($J:$J,11):INDEX($J:$J,100000),\"1_Assigned\")\n+SUMIFS(INDEX(Z:Z,11):INDEX(Z:Z,100000),INDEX($F:$F,11):INDEX($F:$F,100000),$P7,INDEX($J:$J,11):INDEX($J:$J,100000),\"2_InProgress\")\n+SUMIFS(INDEX(Z:Z,11):INDEX(Z:Z,100000),INDEX($F:$F,11):INDEX($F:$F,100000),$P7,INDEX($J:$J,11):INDEX($J:$J,100000),\"3_Prototype\")\n+SUMIFS(INDEX(Z:Z,11):INDEX(Z:Z,100000),INDEX($F:$F,11):INDEX($F:$F,100000),$P7,INDEX($J:$J,11):INDEX($J:$J,100000),\"4_Testing\")","v":0},{"$f":"SUMIFS(INDEX(AA:AA,11):INDEX(AA:AA,100000),INDEX($F:$F,11):INDEX($F:$F,100000),$P7,INDEX($J:$J,11):INDEX($J:$J,100000),\"0_AttentionNeeded\")\n+SUMIFS(INDEX(AA:AA,11):INDEX(AA:AA,100000),INDEX($F:$F,11):INDEX($F:$F,100000),$P7,INDEX($J:$J,11):INDEX($J:$J,100000),\"1_Assigned\")\n+SUMIFS(INDEX(AA:AA,11):INDEX(AA:AA,100000),INDEX($F:$F,11):INDEX($F:$F,100000),$P7,INDEX($J:$J,11):INDEX($J:$J,100000),\"2_InProgress\")\n+SUMIFS(INDEX(AA:AA,11):INDEX(AA:AA,100000),INDEX($F:$F,11):INDEX($F:$F,100000),$P7,INDEX($J:$J,11):INDEX($J:$J,100000),\"3_Prototype\")\n+SUMIFS(INDEX(AA:AA,11):INDEX(AA:AA,100000),INDEX($F:$F,11):INDEX($F:$F,100000),$P7,INDEX($J:$J,11):INDEX($J:$J,100000),\"4_Testing\")","v":0},{"$f":"SUMIFS(INDEX(AB:AB,11):INDEX(AB:AB,100000),INDEX($F:$F,11):INDEX($F:$F,100000),$P7,INDEX($J:$J,11):INDEX($J:$J,100000),\"0_AttentionNeeded\")\n+SUMIFS(INDEX(AB:AB,11):INDEX(AB:AB,100000),INDEX($F:$F,11):INDEX($F:$F,100000),$P7,INDEX($J:$J,11):INDEX($J:$J,100000),\"1_Assigned\")\n+SUMIFS(INDEX(AB:AB,11):INDEX(AB:AB,100000),INDEX($F:$F,11):INDEX($F:$F,100000),$P7,INDEX($J:$J,11):INDEX($J:$J,100000),\"2_InProgress\")\n+SUMIFS(INDEX(AB:AB,11):INDEX(AB:AB,100000),INDEX($F:$F,11):INDEX($F:$F,100000),$P7,INDEX($J:$J,11):INDEX($J:$J,100000),\"3_Prototype\")\n+SUMIFS(INDEX(AB:AB,11):INDEX(AB:AB,100000),INDEX($F:$F,11):INDEX($F:$F,100000),$P7,INDEX($J:$J,11):INDEX($J:$J,100000),\"4_Testing\")","v":0},{"$f":"SUMIFS(INDEX(AC:AC,11):INDEX(AC:AC,100000),INDEX($F:$F,11):INDEX($F:$F,100000),$P7,INDEX($J:$J,11):INDEX($J:$J,100000),\"0_AttentionNeeded\")\n+SUMIFS(INDEX(AC:AC,11):INDEX(AC:AC,100000),INDEX($F:$F,11):INDEX($F:$F,100000),$P7,INDEX($J:$J,11):INDEX($J:$J,100000),\"1_Assigned\")\n+SUMIFS(INDEX(AC:AC,11):INDEX(AC:AC,100000),INDEX($F:$F,11):INDEX($F:$F,100000),$P7,INDEX($J:$J,11):INDEX($J:$J,100000),\"2_InProgress\")\n+SUMIFS(INDEX(AC:AC,11):INDEX(AC:AC,100000),INDEX($F:$F,11):INDEX($F:$F,100000),$P7,INDEX($J:$J,11):INDEX($J:$J,100000),\"3_Prototype\")\n+SUMIFS(INDEX(AC:AC,11):INDEX(AC:AC,100000),INDEX($F:$F,11):INDEX($F:$F,100000),$P7,INDEX($J:$J,11):INDEX($J:$J,100000),\"4_Testing\")","v":0},{"$f":"SUMIFS(INDEX(AD:AD,11):INDEX(AD:AD,100000),INDEX($F:$F,11):INDEX($F:$F,100000),$P7,INDEX($J:$J,11):INDEX($J:$J,100000),\"0_AttentionNeeded\")\n+SUMIFS(INDEX(AD:AD,11):INDEX(AD:AD,100000),INDEX($F:$F,11):INDEX($F:$F,100000),$P7,INDEX($J:$J,11):INDEX($J:$J,100000),\"1_Assigned\")\n+SUMIFS(INDEX(AD:AD,11):INDEX(AD:AD,100000),INDEX($F:$F,11):INDEX($F:$F,100000),$P7,INDEX($J:$J,11):INDEX($J:$J,100000),\"2_InProgress\")\n+SUMIFS(INDEX(AD:AD,11):INDEX(AD:AD,100000),INDEX($F:$F,11):INDEX($F:$F,100000),$P7,INDEX($J:$J,11):INDEX($J:$J,100000),\"3_Prototype\")\n+SUMIFS(INDEX(AD:AD,11):INDEX(AD:AD,100000),INDEX($F:$F,11):INDEX($F:$F,100000),$P7,INDEX($J:$J,11):INDEX($J:$J,100000),\"4_Testing\")","v":0},0,{"$f":"SUMIFS(INDEX(AF:AF,11):INDEX(AF:AF,100000),INDEX($F:$F,11):INDEX($F:$F,100000),$P7,INDEX($J:$J,11):INDEX($J:$J,100000),\"0_AttentionNeeded\")\n+SUMIFS(INDEX(AF:AF,11):INDEX(AF:AF,100000),INDEX($F:$F,11):INDEX($F:$F,100000),$P7,INDEX($J:$J,11):INDEX($J:$J,100000),\"1_Assigned\")\n+SUMIFS(INDEX(AF:AF,11):INDEX(AF:AF,100000),INDEX($F:$F,11):INDEX($F:$F,100000),$P7,INDEX($J:$J,11):INDEX($J:$J,100000),\"2_InProgress\")\n+SUMIFS(INDEX(AF:AF,11):INDEX(AF:AF,100000),INDEX($F:$F,11):INDEX($F:$F,100000),$P7,INDEX($J:$J,11):INDEX($J:$J,100000),\"3_Prototype\")\n+SUMIFS(INDEX(AF:AF,11):INDEX(AF:AF,100000),INDEX($F:$F,11):INDEX($F:$F,100000),$P7,INDEX($J:$J,11):INDEX($J:$J,100000),\"4_Testing\")","v":0},{"$f":"SUMIFS(INDEX(AG:AG,11):INDEX(AG:AG,100000),INDEX($F:$F,11):INDEX($F:$F,100000),$P7,INDEX($J:$J,11):INDEX($J:$J,100000),\"0_AttentionNeeded\")\n+SUMIFS(INDEX(AG:AG,11):INDEX(AG:AG,100000),INDEX($F:$F,11):INDEX($F:$F,100000),$P7,INDEX($J:$J,11):INDEX($J:$J,100000),\"1_Assigned\")\n+SUMIFS(INDEX(AG:AG,11):INDEX(AG:AG,100000),INDEX($F:$F,11):INDEX($F:$F,100000),$P7,INDEX($J:$J,11):INDEX($J:$J,100000),\"2_InProgress\")\n+SUMIFS(INDEX(AG:AG,11):INDEX(AG:AG,100000),INDEX($F:$F,11):INDEX($F:$F,100000),$P7,INDEX($J:$J,11):INDEX($J:$J,100000),\"3_Prototype\")\n+SUMIFS(INDEX(AG:AG,11):INDEX(AG:AG,100000),INDEX($F:$F,11):INDEX($F:$F,100000),$P7,INDEX($J:$J,11):INDEX($J:$J,100000),\"4_Testing\")","v":0},{"$f":"SUMIFS(INDEX(AH:AH,11):INDEX(AH:AH,100000),INDEX($F:$F,11):INDEX($F:$F,100000),$P7,INDEX($J:$J,11):INDEX($J:$J,100000),\"0_AttentionNeeded\")\n+SUMIFS(INDEX(AH:AH,11):INDEX(AH:AH,100000),INDEX($F:$F,11):INDEX($F:$F,100000),$P7,INDEX($J:$J,11):INDEX($J:$J,100000),\"1_Assigned\")\n+SUMIFS(INDEX(AH:AH,11):INDEX(AH:AH,100000),INDEX($F:$F,11):INDEX($F:$F,100000),$P7,INDEX($J:$J,11):INDEX($J:$J,100000),\"2_InProgress\")\n+SUMIFS(INDEX(AH:AH,11):INDEX(AH:AH,100000),INDEX($F:$F,11):INDEX($F:$F,100000),$P7,INDEX($J:$J,11):INDEX($J:$J,100000),\"3_Prototype\")\n+SUMIFS(INDEX(AH:AH,11):INDEX(AH:AH,100000),INDEX($F:$F,11):INDEX($F:$F,100000),$P7,INDEX($J:$J,11):INDEX($J:$J,100000),\"4_Testing\")","v":0},{"$f":"SUMIFS(INDEX(AI:AI,11):INDEX(AI:AI,100000),INDEX($F:$F,11):INDEX($F:$F,100000),$P7,INDEX($J:$J,11):INDEX($J:$J,100000),\"0_AttentionNeeded\")\n+SUMIFS(INDEX(AI:AI,11):INDEX(AI:AI,100000),INDEX($F:$F,11):INDEX($F:$F,100000),$P7,INDEX($J:$J,11):INDEX($J:$J,100000),\"1_Assigned\")\n+SUMIFS(INDEX(AI:AI,11):INDEX(AI:AI,100000),INDEX($F:$F,11):INDEX($F:$F,100000),$P7,INDEX($J:$J,11):INDEX($J:$J,100000),\"2_InProgress\")\n+SUMIFS(INDEX(AI:AI,11):INDEX(AI:AI,100000),INDEX($F:$F,11):INDEX($F:$F,100000),$P7,INDEX($J:$J,11):INDEX($J:$J,100000),\"3_Prototype\")\n+SUMIFS(INDEX(AI:AI,11):INDEX(AI:AI,100000),INDEX($F:$F,11):INDEX($F:$F,100000),$P7,INDEX($J:$J,11):INDEX($J:$J,100000),\"4_Testing\")","v":0},{"$f":"SUMIFS(INDEX(AJ:AJ,11):INDEX(AJ:AJ,100000),INDEX($F:$F,11):INDEX($F:$F,100000),$P7,INDEX($J:$J,11):INDEX($J:$J,100000),\"0_AttentionNeeded\")\n+SUMIFS(INDEX(AJ:AJ,11):INDEX(AJ:AJ,100000),INDEX($F:$F,11):INDEX($F:$F,100000),$P7,INDEX($J:$J,11):INDEX($J:$J,100000),\"1_Assigned\")\n+SUMIFS(INDEX(AJ:AJ,11):INDEX(AJ:AJ,100000),INDEX($F:$F,11):INDEX($F:$F,100000),$P7,INDEX($J:$J,11):INDEX($J:$J,100000),\"2_InProgress\")\n+SUMIFS(INDEX(AJ:AJ,11):INDEX(AJ:AJ,100000),INDEX($F:$F,11):INDEX($F:$F,100000),$P7,INDEX($J:$J,11):INDEX($J:$J,100000),\"3_Prototype\")\n+SUMIFS(INDEX(AJ:AJ,11):INDEX(AJ:AJ,100000),INDEX($F:$F,11):INDEX($F:$F,100000),$P7,INDEX($J:$J,11):INDEX($J:$J,100000),\"4_Testing\")","v":0},{"$f":"SUMIFS(INDEX(AK:AK,11):INDEX(AK:AK,100000),INDEX($F:$F,11):INDEX($F:$F,100000),$P7,INDEX($J:$J,11):INDEX($J:$J,100000),\"0_AttentionNeeded\")\n+SUMIFS(INDEX(AK:AK,11):INDEX(AK:AK,100000),INDEX($F:$F,11):INDEX($F:$F,100000),$P7,INDEX($J:$J,11):INDEX($J:$J,100000),\"1_Assigned\")\n+SUMIFS(INDEX(AK:AK,11):INDEX(AK:AK,100000),INDEX($F:$F,11):INDEX($F:$F,100000),$P7,INDEX($J:$J,11):INDEX($J:$J,100000),\"2_InProgress\")\n+SUMIFS(INDEX(AK:AK,11):INDEX(AK:AK,100000),INDEX($F:$F,11):INDEX($F:$F,100000),$P7,INDEX($J:$J,11):INDEX($J:$J,100000),\"3_Prototype\")\n+SUMIFS(INDEX(AK:AK,11):INDEX(AK:AK,100000),INDEX($F:$F,11):INDEX($F:$F,100000),$P7,INDEX($J:$J,11):INDEX($J:$J,100000),\"4_Testing\")","v":0},0,{"$f":"SUMIFS(INDEX(AM:AM,11):INDEX(AM:AM,100000),INDEX($F:$F,11):INDEX($F:$F,100000),$P7,INDEX($J:$J,11):INDEX($J:$J,100000),\"0_AttentionNeeded\")\n+SUMIFS(INDEX(AM:AM,11):INDEX(AM:AM,100000),INDEX($F:$F,11):INDEX($F:$F,100000),$P7,INDEX($J:$J,11):INDEX($J:$J,100000),\"1_Assigned\")\n+SUMIFS(INDEX(AM:AM,11):INDEX(AM:AM,100000),INDEX($F:$F,11):INDEX($F:$F,100000),$P7,INDEX($J:$J,11):INDEX($J:$J,100000),\"2_InProgress\")\n+SUMIFS(INDEX(AM:AM,11):INDEX(AM:AM,100000),INDEX($F:$F,11):INDEX($F:$F,100000),$P7,INDEX($J:$J,11):INDEX($J:$J,100000),\"3_Prototype\")\n+SUMIFS(INDEX(AM:AM,11):INDEX(AM:AM,100000),INDEX($F:$F,11):INDEX($F:$F,100000),$P7,INDEX($J:$J,11):INDEX($J:$J,100000),\"4_Testing\")","v":0},{"$f":"SUMIFS(INDEX(AN:AN,11):INDEX(AN:AN,100000),INDEX($F:$F,11):INDEX($F:$F,100000),$P7,INDEX($J:$J,11):INDEX($J:$J,100000),\"0_AttentionNeeded\")\n+SUMIFS(INDEX(AN:AN,11):INDEX(AN:AN,100000),INDEX($F:$F,11):INDEX($F:$F,100000),$P7,INDEX($J:$J,11):INDEX($J:$J,100000),\"1_Assigned\")\n+SUMIFS(INDEX(AN:AN,11):INDEX(AN:AN,100000),INDEX($F:$F,11):INDEX($F:$F,100000),$P7,INDEX($J:$J,11):INDEX($J:$J,100000),\"2_InProgress\")\n+SUMIFS(INDEX(AN:AN,11):INDEX(AN:AN,100000),INDEX($F:$F,11):INDEX($F:$F,100000),$P7,INDEX($J:$J,11):INDEX($J:$J,100000),\"3_Prototype\")\n+SUMIFS(INDEX(AN:AN,11):INDEX(AN:AN,100000),INDEX($F:$F,11):INDEX($F:$F,100000),$P7,INDEX($J:$J,11):INDEX($J:$J,100000),\"4_Testing\")","v":0},{"$f":"SUMIFS(INDEX(AO:AO,11):INDEX(AO:AO,100000),INDEX($F:$F,11):INDEX($F:$F,100000),$P7,INDEX($J:$J,11):INDEX($J:$J,100000),\"0_AttentionNeeded\")\n+SUMIFS(INDEX(AO:AO,11):INDEX(AO:AO,100000),INDEX($F:$F,11):INDEX($F:$F,100000),$P7,INDEX($J:$J,11):INDEX($J:$J,100000),\"1_Assigned\")\n+SUMIFS(INDEX(AO:AO,11):INDEX(AO:AO,100000),INDEX($F:$F,11):INDEX($F:$F,100000),$P7,INDEX($J:$J,11):INDEX($J:$J,100000),\"2_InProgress\")\n+SUMIFS(INDEX(AO:AO,11):INDEX(AO:AO,100000),INDEX($F:$F,11):INDEX($F:$F,100000),$P7,INDEX($J:$J,11):INDEX($J:$J,100000),\"3_Prototype\")\n+SUMIFS(INDEX(AO:AO,11):INDEX(AO:AO,100000),INDEX($F:$F,11):INDEX($F:$F,100000),$P7,INDEX($J:$J,11):INDEX($J:$J,100000),\"4_Testing\")","v":0},{"$f":"SUMIFS(INDEX(AP:AP,11):INDEX(AP:AP,100000),INDEX($F:$F,11):INDEX($F:$F,100000),$P7,INDEX($J:$J,11):INDEX($J:$J,100000),\"0_AttentionNeeded\")\n+SUMIFS(INDEX(AP:AP,11):INDEX(AP:AP,100000),INDEX($F:$F,11):INDEX($F:$F,100000),$P7,INDEX($J:$J,11):INDEX($J:$J,100000),\"1_Assigned\")\n+SUMIFS(INDEX(AP:AP,11):INDEX(AP:AP,100000),INDEX($F:$F,11):INDEX($F:$F,100000),$P7,INDEX($J:$J,11):INDEX($J:$J,100000),\"2_InProgress\")\n+SUMIFS(INDEX(AP:AP,11):INDEX(AP:AP,100000),INDEX($F:$F,11):INDEX($F:$F,100000),$P7,INDEX($J:$J,11):INDEX($J:$J,100000),\"3_Prototype\")\n+SUMIFS(INDEX(AP:AP,11):INDEX(AP:AP,100000),INDEX($F:$F,11):INDEX($F:$F,100000),$P7,INDEX($J:$J,11):INDEX($J:$J,100000),\"4_Testing\")","v":0},{"$f":"SUMIFS(INDEX(AQ:AQ,11):INDEX(AQ:AQ,100000),INDEX($F:$F,11):INDEX($F:$F,100000),$P7,INDEX($J:$J,11):INDEX($J:$J,100000),\"0_AttentionNeeded\")\n+SUMIFS(INDEX(AQ:AQ,11):INDEX(AQ:AQ,100000),INDEX($F:$F,11):INDEX($F:$F,100000),$P7,INDEX($J:$J,11):INDEX($J:$J,100000),\"1_Assigned\")\n+SUMIFS(INDEX(AQ:AQ,11):INDEX(AQ:AQ,100000),INDEX($F:$F,11):INDEX($F:$F,100000),$P7,INDEX($J:$J,11):INDEX($J:$J,100000),\"2_InProgress\")\n+SUMIFS(INDEX(AQ:AQ,11):INDEX(AQ:AQ,100000),INDEX($F:$F,11):INDEX($F:$F,100000),$P7,INDEX($J:$J,11):INDEX($J:$J,100000),\"3_Prototype\")\n+SUMIFS(INDEX(AQ:AQ,11):INDEX(AQ:AQ,100000),INDEX($F:$F,11):INDEX($F:$F,100000),$P7,INDEX($J:$J,11):INDEX($J:$J,100000),\"4_Testing\")","v":0},{"$f":"SUMIFS(INDEX(AR:AR,11):INDEX(AR:AR,100000),INDEX($F:$F,11):INDEX($F:$F,100000),$P7,INDEX($J:$J,11):INDEX($J:$J,100000),\"0_AttentionNeeded\")\n+SUMIFS(INDEX(AR:AR,11):INDEX(AR:AR,100000),INDEX($F:$F,11):INDEX($F:$F,100000),$P7,INDEX($J:$J,11):INDEX($J:$J,100000),\"1_Assigned\")\n+SUMIFS(INDEX(AR:AR,11):INDEX(AR:AR,100000),INDEX($F:$F,11):INDEX($F:$F,100000),$P7,INDEX($J:$J,11):INDEX($J:$J,100000),\"2_InProgress\")\n+SUMIFS(INDEX(AR:AR,11):INDEX(AR:AR,100000),INDEX($F:$F,11):INDEX($F:$F,100000),$P7,INDEX($J:$J,11):INDEX($J:$J,100000),\"3_Prototype\")\n+SUMIFS(INDEX(AR:AR,11):INDEX(AR:AR,100000),INDEX($F:$F,11):INDEX($F:$F,100000),$P7,INDEX($J:$J,11):INDEX($J:$J,100000),\"4_Testing\")","v":0},0,{"$f":"SUMIFS(INDEX(AT:AT,11):INDEX(AT:AT,100000),INDEX($F:$F,11):INDEX($F:$F,100000),$P7,INDEX($J:$J,11):INDEX($J:$J,100000),\"0_AttentionNeeded\")\n+SUMIFS(INDEX(AT:AT,11):INDEX(AT:AT,100000),INDEX($F:$F,11):INDEX($F:$F,100000),$P7,INDEX($J:$J,11):INDEX($J:$J,100000),\"1_Assigned\")\n+SUMIFS(INDEX(AT:AT,11):INDEX(AT:AT,100000),INDEX($F:$F,11):INDEX($F:$F,100000),$P7,INDEX($J:$J,11):INDEX($J:$J,100000),\"2_InProgress\")\n+SUMIFS(INDEX(AT:AT,11):INDEX(AT:AT,100000),INDEX($F:$F,11):INDEX($F:$F,100000),$P7,INDEX($J:$J,11):INDEX($J:$J,100000),\"3_Prototype\")\n+SUMIFS(INDEX(AT:AT,11):INDEX(AT:AT,100000),INDEX($F:$F,11):INDEX($F:$F,100000),$P7,INDEX($J:$J,11):INDEX($J:$J,100000),\"4_Testing\")","v":0},{"$f":"SUMIFS(INDEX(AU:AU,11):INDEX(AU:AU,100000),INDEX($F:$F,11):INDEX($F:$F,100000),$P7,INDEX($J:$J,11):INDEX($J:$J,100000),\"0_AttentionNeeded\")\n+SUMIFS(INDEX(AU:AU,11):INDEX(AU:AU,100000),INDEX($F:$F,11):INDEX($F:$F,100000),$P7,INDEX($J:$J,11):INDEX($J:$J,100000),\"1_Assigned\")\n+SUMIFS(INDEX(AU:AU,11):INDEX(AU:AU,100000),INDEX($F:$F,11):INDEX($F:$F,100000),$P7,INDEX($J:$J,11):INDEX($J:$J,100000),\"2_InProgress\")\n+SUMIFS(INDEX(AU:AU,11):INDEX(AU:AU,100000),INDEX($F:$F,11):INDEX($F:$F,100000),$P7,INDEX($J:$J,11):INDEX($J:$J,100000),\"3_Prototype\")\n+SUMIFS(INDEX(AU:AU,11):INDEX(AU:AU,100000),INDEX($F:$F,11):INDEX($F:$F,100000),$P7,INDEX($J:$J,11):INDEX($J:$J,100000),\"4_Testing\")","v":0},{"$f":"SUMIFS(INDEX(AV:AV,11):INDEX(AV:AV,100000),INDEX($F:$F,11):INDEX($F:$F,100000),$P7,INDEX($J:$J,11):INDEX($J:$J,100000),\"0_AttentionNeeded\")\n+SUMIFS(INDEX(AV:AV,11):INDEX(AV:AV,100000),INDEX($F:$F,11):INDEX($F:$F,100000),$P7,INDEX($J:$J,11):INDEX($J:$J,100000),\"1_Assigned\")\n+SUMIFS(INDEX(AV:AV,11):INDEX(AV:AV,100000),INDEX($F:$F,11):INDEX($F:$F,100000),$P7,INDEX($J:$J,11):INDEX($J:$J,100000),\"2_InProgress\")\n+SUMIFS(INDEX(AV:AV,11):INDEX(AV:AV,100000),INDEX($F:$F,11):INDEX($F:$F,100000),$P7,INDEX($J:$J,11):INDEX($J:$J,100000),\"3_Prototype\")\n+SUMIFS(INDEX(AV:AV,11):INDEX(AV:AV,100000),INDEX($F:$F,11):INDEX($F:$F,100000),$P7,INDEX($J:$J,11):INDEX($J:$J,100000),\"4_Testing\")","v":0},{"$f":"SUMIFS(INDEX(AW:AW,11):INDEX(AW:AW,100000),INDEX($F:$F,11):INDEX($F:$F,100000),$P7,INDEX($J:$J,11):INDEX($J:$J,100000),\"0_AttentionNeeded\")\n+SUMIFS(INDEX(AW:AW,11):INDEX(AW:AW,100000),INDEX($F:$F,11):INDEX($F:$F,100000),$P7,INDEX($J:$J,11):INDEX($J:$J,100000),\"1_Assigned\")\n+SUMIFS(INDEX(AW:AW,11):INDEX(AW:AW,100000),INDEX($F:$F,11):INDEX($F:$F,100000),$P7,INDEX($J:$J,11):INDEX($J:$J,100000),\"2_InProgress\")\n+SUMIFS(INDEX(AW:AW,11):INDEX(AW:AW,100000),INDEX($F:$F,11):INDEX($F:$F,100000),$P7,INDEX($J:$J,11):INDEX($J:$J,100000),\"3_Prototype\")\n+SUMIFS(INDEX(AW:AW,11):INDEX(AW:AW,100000),INDEX($F:$F,11):INDEX($F:$F,100000),$P7,INDEX($J:$J,11):INDEX($J:$J,100000),\"4_Testing\")","v":0},{"$f":"SUMIFS(INDEX(AX:AX,11):INDEX(AX:AX,100000),INDEX($F:$F,11):INDEX($F:$F,100000),$P7,INDEX($J:$J,11):INDEX($J:$J,100000),\"0_AttentionNeeded\")\n+SUMIFS(INDEX(AX:AX,11):INDEX(AX:AX,100000),INDEX($F:$F,11):INDEX($F:$F,100000),$P7,INDEX($J:$J,11):INDEX($J:$J,100000),\"1_Assigned\")\n+SUMIFS(INDEX(AX:AX,11):INDEX(AX:AX,100000),INDEX($F:$F,11):INDEX($F:$F,100000),$P7,INDEX($J:$J,11):INDEX($J:$J,100000),\"2_InProgress\")\n+SUMIFS(INDEX(AX:AX,11):INDEX(AX:AX,100000),INDEX($F:$F,11):INDEX($F:$F,100000),$P7,INDEX($J:$J,11):INDEX($J:$J,100000),\"3_Prototype\")\n+SUMIFS(INDEX(AX:AX,11):INDEX(AX:AX,100000),INDEX($F:$F,11):INDEX($F:$F,100000),$P7,INDEX($J:$J,11):INDEX($J:$J,100000),\"4_Testing\")","v":0},{"$f":"SUMIFS(INDEX(AY:AY,11):INDEX(AY:AY,100000),INDEX($F:$F,11):INDEX($F:$F,100000),$P7,INDEX($J:$J,11):INDEX($J:$J,100000),\"0_AttentionNeeded\")\n+SUMIFS(INDEX(AY:AY,11):INDEX(AY:AY,100000),INDEX($F:$F,11):INDEX($F:$F,100000),$P7,INDEX($J:$J,11):INDEX($J:$J,100000),\"1_Assigned\")\n+SUMIFS(INDEX(AY:AY,11):INDEX(AY:AY,100000),INDEX($F:$F,11):INDEX($F:$F,100000),$P7,INDEX($J:$J,11):INDEX($J:$J,100000),\"2_InProgress\")\n+SUMIFS(INDEX(AY:AY,11):INDEX(AY:AY,100000),INDEX($F:$F,11):INDEX($F:$F,100000),$P7,INDEX($J:$J,11):INDEX($J:$J,100000),\"3_Prototype\")\n+SUMIFS(INDEX(AY:AY,11):INDEX(AY:AY,100000),INDEX($F:$F,11):INDEX($F:$F,100000),$P7,INDEX($J:$J,11):INDEX($J:$J,100000),\"4_Testing\")","v":0},0,{"$f":"SUMIFS(INDEX(BA:BA,11):INDEX(BA:BA,100000),INDEX($F:$F,11):INDEX($F:$F,100000),$P7,INDEX($J:$J,11):INDEX($J:$J,100000),\"0_AttentionNeeded\")\n+SUMIFS(INDEX(BA:BA,11):INDEX(BA:BA,100000),INDEX($F:$F,11):INDEX($F:$F,100000),$P7,INDEX($J:$J,11):INDEX($J:$J,100000),\"1_Assigned\")\n+SUMIFS(INDEX(BA:BA,11):INDEX(BA:BA,100000),INDEX($F:$F,11):INDEX($F:$F,100000),$P7,INDEX($J:$J,11):INDEX($J:$J,100000),\"2_InProgress\")\n+SUMIFS(INDEX(BA:BA,11):INDEX(BA:BA,100000),INDEX($F:$F,11):INDEX($F:$F,100000),$P7,INDEX($J:$J,11):INDEX($J:$J,100000),\"3_Prototype\")\n+SUMIFS(INDEX(BA:BA,11):INDEX(BA:BA,100000),INDEX($F:$F,11):INDEX($F:$F,100000),$P7,INDEX($J:$J,11):INDEX($J:$J,100000),\"4_Testing\")","v":0},{"$f":"SUMIFS(INDEX(BB:BB,11):INDEX(BB:BB,100000),INDEX($F:$F,11):INDEX($F:$F,100000),$P7,INDEX($J:$J,11):INDEX($J:$J,100000),\"0_AttentionNeeded\")\n+SUMIFS(INDEX(BB:BB,11):INDEX(BB:BB,100000),INDEX($F:$F,11):INDEX($F:$F,100000),$P7,INDEX($J:$J,11):INDEX($J:$J,100000),\"1_Assigned\")\n+SUMIFS(INDEX(BB:BB,11):INDEX(BB:BB,100000),INDEX($F:$F,11):INDEX($F:$F,100000),$P7,INDEX($J:$J,11):INDEX($J:$J,100000),\"2_InProgress\")\n+SUMIFS(INDEX(BB:BB,11):INDEX(BB:BB,100000),INDEX($F:$F,11):INDEX($F:$F,100000),$P7,INDEX($J:$J,11):INDEX($J:$J,100000),\"3_Prototype\")\n+SUMIFS(INDEX(BB:BB,11):INDEX(BB:BB,100000),INDEX($F:$F,11):INDEX($F:$F,100000),$P7,INDEX($J:$J,11):INDEX($J:$J,100000),\"4_Testing\")","v":0},{"$f":"SUMIFS(INDEX(BC:BC,11):INDEX(BC:BC,100000),INDEX($F:$F,11):INDEX($F:$F,100000),$P7,INDEX($J:$J,11):INDEX($J:$J,100000),\"0_AttentionNeeded\")\n+SUMIFS(INDEX(BC:BC,11):INDEX(BC:BC,100000),INDEX($F:$F,11):INDEX($F:$F,100000),$P7,INDEX($J:$J,11):INDEX($J:$J,100000),\"1_Assigned\")\n+SUMIFS(INDEX(BC:BC,11):INDEX(BC:BC,100000),INDEX($F:$F,11):INDEX($F:$F,100000),$P7,INDEX($J:$J,11):INDEX($J:$J,100000),\"2_InProgress\")\n+SUMIFS(INDEX(BC:BC,11):INDEX(BC:BC,100000),INDEX($F:$F,11):INDEX($F:$F,100000),$P7,INDEX($J:$J,11):INDEX($J:$J,100000),\"3_Prototype\")\n+SUMIFS(INDEX(BC:BC,11):INDEX(BC:BC,100000),INDEX($F:$F,11):INDEX($F:$F,100000),$P7,INDEX($J:$J,11):INDEX($J:$J,100000),\"4_Testing\")","v":0},{"$f":"SUMIFS(INDEX(BD:BD,11):INDEX(BD:BD,100000),INDEX($F:$F,11):INDEX($F:$F,100000),$P7,INDEX($J:$J,11):INDEX($J:$J,100000),\"0_AttentionNeeded\")\n+SUMIFS(INDEX(BD:BD,11):INDEX(BD:BD,100000),INDEX($F:$F,11):INDEX($F:$F,100000),$P7,INDEX($J:$J,11):INDEX($J:$J,100000),\"1_Assigned\")\n+SUMIFS(INDEX(BD:BD,11):INDEX(BD:BD,100000),INDEX($F:$F,11):INDEX($F:$F,100000),$P7,INDEX($J:$J,11):INDEX($J:$J,100000),\"2_InProgress\")\n+SUMIFS(INDEX(BD:BD,11):INDEX(BD:BD,100000),INDEX($F:$F,11):INDEX($F:$F,100000),$P7,INDEX($J:$J,11):INDEX($J:$J,100000),\"3_Prototype\")\n+SUMIFS(INDEX(BD:BD,11):INDEX(BD:BD,100000),INDEX($F:$F,11):INDEX($F:$F,100000),$P7,INDEX($J:$J,11):INDEX($J:$J,100000),\"4_Testing\")","v":0},{"$f":"SUMIFS(INDEX(BE:BE,11):INDEX(BE:BE,100000),INDEX($F:$F,11):INDEX($F:$F,100000),$P7,INDEX($J:$J,11):INDEX($J:$J,100000),\"0_AttentionNeeded\")\n+SUMIFS(INDEX(BE:BE,11):INDEX(BE:BE,100000),INDEX($F:$F,11):INDEX($F:$F,100000),$P7,INDEX($J:$J,11):INDEX($J:$J,100000),\"1_Assigned\")\n+SUMIFS(INDEX(BE:BE,11):INDEX(BE:BE,100000),INDEX($F:$F,11):INDEX($F:$F,100000),$P7,INDEX($J:$J,11):INDEX($J:$J,100000),\"2_InProgress\")\n+SUMIFS(INDEX(BE:BE,11):INDEX(BE:BE,100000),INDEX($F:$F,11):INDEX($F:$F,100000),$P7,INDEX($J:$J,11):INDEX($J:$J,100000),\"3_Prototype\")\n+SUMIFS(INDEX(BE:BE,11):INDEX(BE:BE,100000),INDEX($F:$F,11):INDEX($F:$F,100000),$P7,INDEX($J:$J,11):INDEX($J:$J,100000),\"4_Testing\")","v":0},{"$f":"SUMIFS(INDEX(BF:BF,11):INDEX(BF:BF,100000),INDEX($F:$F,11):INDEX($F:$F,100000),$P7,INDEX($J:$J,11):INDEX($J:$J,100000),\"0_AttentionNeeded\")\n+SUMIFS(INDEX(BF:BF,11):INDEX(BF:BF,100000),INDEX($F:$F,11):INDEX($F:$F,100000),$P7,INDEX($J:$J,11):INDEX($J:$J,100000),\"1_Assigned\")\n+SUMIFS(INDEX(BF:BF,11):INDEX(BF:BF,100000),INDEX($F:$F,11):INDEX($F:$F,100000),$P7,INDEX($J:$J,11):INDEX($J:$J,100000),\"2_InProgress\")\n+SUMIFS(INDEX(BF:BF,11):INDEX(BF:BF,100000),INDEX($F:$F,11):INDEX($F:$F,100000),$P7,INDEX($J:$J,11):INDEX($J:$J,100000),\"3_Prototype\")\n+SUMIFS(INDEX(BF:BF,11):INDEX(BF:BF,100000),INDEX($F:$F,11):INDEX($F:$F,100000),$P7,INDEX($J:$J,11):INDEX($J:$J,100000),\"4_Testing\")","v":0}]
[{"$f":"IF(Admin!$B$10=\"NO\",\"\",IF(Admin!$B$2=\"MONTH\",IF(MONTH(NOW())<>MONTH(Admin!$B$4),\"This is a free version. Contact Exceldepartment for unlocking full potential of the model.\",\"\"),\nIF(Admin!$B$2=\"QRT\",IF(INT((MONTH(NOW())+2)/3)<>INT((MONTH(Admin!$B$4)+2)/3),\"This is a free version. Contact Exceldepartment for unlocking full potential of the model.\",\"\"),\nIF(Admin!$B$2=\"YEAR\",IF(YEAR(NOW())<>YEAR(Admin!$B$4),\"This is a free version. Contact Exceldepartment for unlocking full potential of the model.\",\"\"),\n\"This is a free version. Contact Exceldepartment for unlocking full potential of the model.\"))))","v":"This is a free version. Contact Exceldepartment for unlocking full potential of the model."},null,null,null,null,null,null,null,null,null,null,null,null,null,null,null,"2023-06-17",null,null,null,null,null,null,null,{"$f":"Y9","v":"2023-06-24"},null,null,null,null,null,null,{"$f":"AF9","v":"2023-07-01"},null,null,null,null,null,null,{"$f":"AM9","v":"2023-07-08"},null,null,null,null,null,null,{"$f":"AT9","v":"2023-07-15"},null,null,null,null,null,null,{"$f":"BA9","v":"2023-07-22"}]
[null,null,null,null,null,null,null,null,null,null,null,null,null,null,null,{"$f":"IFERROR(IF(SUM(Y9:AD9)>0,1,IF(SUM(R9:W9)>0,0.5,0)),\"\")","v":1},{"$f":"Q8-1","v":"2023-06-16"},{"$f":"Q9+1","v":"2023-06-17"},"2023-06-18","2023-06-19","2023-06-20","2023-06-21","2023-06-22","2023-06-23","2023-06-24","2023-06-25","2023-06-26","2023-06-27","2023-06-28","2023-06-29","2023-06-30","2023-07-01","2023-07-02","2023-07-03","2023-07-04","2023-07-05","2023-07-06","2023-07-07","2023-07-08","2023-07-09","2023-07-10","2023-07-11","2023-07-12","2023-07-13","2023-07-14","2023-07-15","2023-07-16","2023-07-17","2023-07-18","2023-07-19","2023-07-20","2023-07-21","2023-07-22","2023-07-23","2023-07-24","2023-07-25","2023-07-26","2023-07-27",{"$f":"IF(D9<>\"\",\n_xlfn.MINIFS(INDIRECT(\"$G$17:$G$3000\"),INDIRECT(\"$D$17:$D$3000\"),D9,INDIRECT(\"$C$17:$C$3000\"),C9)+LEN(C9)/1000+LEN(D9)/1000,\nIF(I9=\"\",IF(D9=\"\",G9,_xlfn.MINIFS(INDIRECT(\"$G$17:$G$3000\"),INDIRECT(\"$D$17:$D$3000\"),D9,INDIRECT(\"$C$17:$C$3000\"),C9)),I9)+IF(IF(I9=\"\",H9,I9)<$Q$8,365,0)+IF(IF(D9=\"\",G9,_xlfn.MINIFS(INDIRECT(\"$G$17:$G$3000\"),INDIRECT(\"$D$17:$D$3000\"),D9,INDIRECT(\"$C$17:$C$3000\"),C9))=\"\",$Q$8+365*2,0)+IF(J9=\"50_none\",365,0)+LEN(C9)/1000)-IF(O9=\"\",0,IF(O9*1<100,(100-O9*1)*365,0))","v":"2026-06-16"}]
["_Key","_Task","_Project","_SubProject","_Hours","_Staff","_StartDate","_EndDate","_PlannedDate","_Status","_Comment","_MainCategory","_Category","_SubCategory","_Priority","CurrWeek","Sun","Mon","Tue","Wed","Thr","Fri","Sat","Sun","Mon","Tue","Wed","Thr","Fri","Sat","Sun","Mon","Tue","Wed","Thr","Fri","Sat","Sun","Mon","Tue","Wed","Thr","Fri","Sat","Sun","Mon","Tue","Wed","Thr","Fri","Sat","Sun","Mon","Tue","Wed","Thr","Fri","Sat","_SortDate","_isCurrentWeek"]

{"sheet":"BUDGET","index":5,"n_rows":109,"n_cols":194,"rows_kept":109,"cut":false,"hidden":false,"merged":[]}
[]
[]
[]
[null,{"$f":"TODAY()","v":"2023-10-24"}]
[]
[]
[null,null,null,null,null,null,null,null,null,null,null,null,null,null,null,null,null,null,null,null,null,null,null,null,null,null,null,null,null,null,null,null,null,null,null,null,null,null,null,null,null,null,null,null,null,null,null,null,null,null,null,null,null,null,null,null,null,null,null,null,null,null,null,null,null,null,null,null,null,null,null,null,null,null,null,null,null,null,null,null,null,null,null,null,null,null,null,null,null,null,null,null,null,null,null,null,null,null,null,null,null,null,null,null,null,null,null,null,null,null,null,null,null,null,null,null,null,null,null,null,null,null,null,null,null,null,null,null,null,null,null,null,null,null,null,null,null,null,null,null,null,null,null,null,null,null,null,null,null,null,null,null,null,null,null,null,null,null,null,null,null,null,null,null,null,null,null,"","","","","","","","","","","","","","","","","","",""]
[null,{"$f":"IF(Admin!$B$10=\"NO\",\"\",IF(Admin!$B$2=\"MONTH\",IF(MONTH(NOW())<>MONTH(Admin!$B$4),\"This is a free version. Contact Exceldepartment for unlocking full potential of the model.\",\"\"),\nIF(Admin!$B$2=\"QRT\",IF(INT((MONTH(NOW())+2)/3)<>INT((MONTH(Admin!$B$4)+2)/3),\"This is a free version. Contact Exceldepartment for unlocking full potential of the model.\",\"\"),\nIF(Admin!$B$2=\"YEAR\",IF(YEAR(NOW())<>YEAR(Admin!$B$4),\"This is a free version. Contact Exceldepartment for unlocking full potential of the model.\",\"\"),\n\"This is a free version. Contact Exceldepartment for unlocking full potential of the model.\"))))","v":"This is a free version. Contact Exceldepartment for unlocking full potential of the model."},null,null,null,null,null,null,null,null,null,null,null,null,null,null,null,null,null,null,null,null,null,null,null,null,null,null,null,"Total",{"$f":"SUM(AE11:AE105)","v":0},{"$f":"SUM(AF11:AF105)","v":0},{"$f":"SUM(AG11:AG105)","v":0},{"$f":"SUM(AH11:AH105)","v":0},{"$f":"SUM(AI11:AI105)","v":0},null,null,null,null,null,null,null,null,null,null,null,null,null,null,null,null,null,null,null,null,null,null,null,null,null,null,null,null,null,null,null,null,null,null,null,null,null,null,null,null,null,null,null,null,null,null,null,null,null,null,null,null,null,null,null,null,null,null,null,null,null,null,null,null,null,null,null,null,null,null,null,null,null,null,null,null,null,null,null,null,null,null,null,null,null,null,null,null,null,null,null,null,null,null,null,null,null,null,null,null,null,null,null,null,null,null,null,null,null,null,null,null,null,null,null,null,null,null,null,null,null,null,null,null,null,null,null,null,null,null,null,null,null,null,null,null,null,null,null,null,null,null,null,null,null,null,null,null,null,null,null,null,null,null,null,null,null,null,{"$f":"SUM(GL11:GL39)","v":214.09180000000001}]
[null,"Sum of _hours",null,null,null,null,"_ProjectType",null,null,null,null,null,null,null,null,null,null,null,null,null,null,null,null,null,null,null,null,null,null,null,null,null,null,null,null,null,{"$f":"IF($AD9=\"\",\"\",IF(AK$10<=$AG9,\"Finished\",IF(AK$10<=MIN($AE9,$AF9),\"Actual\",IF(AK$10<=$AE9,\"BudgetLeft\",IF(AK$10<=$AF9,\"BudgetOver\",\"\")))))","v":""},"","","","","","","","","","","","","","","","","","","","","","","","","","","","","","","","","","","","","","","","","","","","","","","","","","","","","","","","","","","","","","","",{"$f":"IF($AD9=\"\",\"\",IF(CW$10<=$AG9,\"Finished\",IF(CW$10<=MIN($AE9,$AF9),\"Actual\",IF(CW$10<=$AE9,\"BudgetLeft\",IF(CW$10<=$AF9,\"BudgetOver\",\"\")))))","v":""},"","","","","","","","","","","","","","","","","","","","","","","","","","","","","","","","","","","","","","","","","","","","","","","","","","","","","","","","","","","","","","","",{"$f":"IF($AD9=\"\",\"\",IF(FI$10<=$AG9,\"Finished\",IF(FI$10<=MIN($AE9,$AF9),\"Actual\",IF(FI$10<=$AE9,\"BudgetLeft\",IF(FI$10<=$AF9,\"BudgetOver\",\"\")))))","v":""},"","","","","","","","","","","","","","","","","","","","",""]
[null,"_Project","_Status","_SubProject","_Staff","_Comment","(blank)",null,null,null,null,null,null,null,null,null,null,null,null,null,null,null,null,null,null,null,"Name 1","ExcludeList","Budgeted 2","Name 2","Budgeted","Actual","Finished","Budget Left","Over Budget",null,1,2,3,4,5,6,7,8,9,10,11,12,13,14,15,16,17,18,19,20,21,22,23,24,25,26,27,28,29,30,31,32,33,34,35,36,37,38,39,40,41,42,43,44,45,46,47,48,49,50,51,52,53,54,55,56,57,58,59,60,61,62,63,64,65,66,67,68,69,70,71,72,73,74,75,76,77,78,79,80,81,82,83,84,85,86,87,88,89,90,91,92,93,94,95,96,97,98,99,100,101,102,103,104,105,106,107,108,109,110,111,112,113,114,115,116,117,118,119,120,121,122,123,124,125,126,127,128,129,130,131,132,133,134,135,136,137,138,139,140,141,142,143,144,145,146,147,148,149,150,null,null,null,null,"Name 2","Budgeted","Chance","Adjusted Hours"]
[null,"(blank)","(blank)","(blank)","(blank)","(blank)",null,null,null,null,null,null,null,null,null,null,null,null,null,null,null,null,null,null,null,null,{"$f":"_xlfn.UNIQUE($B$11:$B$917)","v":"(blank)"},"(blank)",{"$f":"IF(OR(AA11=\"\",COUNTIFS($AB$11:$AB$38,AA11)=1),\"\",SUMIFS($G$11:$G$600,$B$11:$B$600,AA11)+ROW(AA11)*0.0001)","v":""},{"$f":"IFERROR(IF(AE11=\"\",\"\",INDEX($AA$10:$AC$207,MATCH(AE11,$AC$10:$AC$199,0),1)),\"\")","v":""},{"$f":"IFERROR(LARGE($AC$11:$AC$207,ROW(AC11)-10),\"\")","v":""},{"$f":"IFERROR(SUMIFS($H$11:$H$599,$B$11:$B$599,AD11),\"\")","v":0},{"$f":"IFERROR(SUMIFS($G$11:$G$599,$B$11:$B$599,AD11,$C$11:$C$599,\"6_Implemented\")+SUMIFS($G$11:$G$599,$B$11:$B$599,AD11,$C$11:$C$599,\"5_Readay\"),\"\")","v":0},{"$f":"IFERROR(MAX(AE11-AF11,0),\"\")","v":""},{"$f":"IFERROR(MAX(AF11-AE11,0),\"\")","v":""},null,{"$f":"IF($AD11=\"\",\"\",IF(AK$10<=$AG11,\"Finished\",IF(AK$10<=MIN($AE11,$AF11),\"Actual\",IF(AK$10<=$AE11,\"BudgetLeft\",IF(AK$10<=$AF11,\"BudgetOver\",\"\")))))","v":""},"","","","","","","","","","","","","","","",{"$f":"IF($AD11=\"\",\"\",IF(BA$10<=$AG11,\"Finished\",IF(BA$10<=MIN($AE11,$AF11),\"Actual\",IF(BA$10<=$AE11,\"BudgetLeft\",IF(BA$10<=$AF11,\"BudgetOver\",\"\")))))","v":""},"","","","","","","","","","","","","","","",{"$f":"IF($AD11=\"\",\"\",IF(BQ$10<=$AG11,\"Finished\",IF(BQ$10<=MIN($AE11,$AF11),\"Actual\",IF(BQ$10<=$AE11,\"BudgetLeft\",IF(BQ$10<=$AF11,\"BudgetOver\",\"\")))))","v":""},"","","","","","","","","","","","","","","",{"$f":"IF($AD11=\"\",\"\",IF(CG$10<=$AG11,\"Finished\",IF(CG$10<=MIN($AE11,$AF11),\"Actual\",IF(CG$10<=$AE11,\"BudgetLeft\",IF(CG$10<=$AF11,\"BudgetOver\",\"\")))))","v":""},"","","","","","","","","","","","","","","",{"$f":"IF($AD11=\"\",\"\",IF(CW$10<=$AG11,\"Finished\",IF(CW$10<=MIN($AE11,$AF11),\"Actual\",IF(CW$10<=$AE11,\"BudgetLeft\",IF(CW$10<=$AF11,\"BudgetOver\",\"\")))))","v":""},"","","","","","","","","","","","","","","",{"$f":"IF($AD11=\"\",\"\",IF(DM$10<=$AG11,\"Finished\",IF(DM$10<=MIN($AE11,$AF11),\"Actual\",IF(DM$10<=$AE11,\"BudgetLeft\",IF(DM$10<=$AF11,\"BudgetOver\",\"\")))))","v":""},"","","","","","","","","","","","","","","",{"$f":"IF($AD11=\"\",\"\",IF(EC$10<=$AG11,\"Finished\",IF(EC$10<=MIN($AE11,$AF11),\"Actual\",IF(EC$10<=$AE11,\"BudgetLeft\",IF(EC$10<=$AF11,\"BudgetOver\",\"\")))))","v":""},"","","","","","","","","","","","","","","",{"$f":"IF($AD11=\"\",\"\",IF(ES$10<=$AG11,\"Finished\",IF(ES$10<=MIN($AE11,$AF11),\"Actual\",IF(ES$10<=$AE11,\"BudgetLeft\",IF(ES$10<=$AF11,\"BudgetOver\",\"\")))))","v":""},"","","","","","","","","","","","","","","",{"$f":"IF($AD11=\"\",\"\",IF(FI$10<=$AG11,\"Finished\",IF(FI$10<=MIN($AE11,$AF11),\"Actual\",IF(FI$10<=$AE11,\"BudgetLeft\",IF(FI$10<=$AF11,\"BudgetOver\",\"\")))))","v":""},"","","","","","","","","","","","","","","",{"$f":"IF($AD11=\"\",\"\",IF(FY$10<=$AG11,\"Finished\",IF(FY$10<=MIN($AE11,$AF11),\"Actual\",IF(FY$10<=$AE11,\"BudgetLeft\",IF(FY$10<=$AF11,\"BudgetOver\",\"\")))))","v":""},"","","","","",null,null,null,null,"JobMan",82.501800000000003,0.6,{"$f":"GK11*GJ11","v":49.501080000000002}]
[null,null,null,null,null,null,null,null,null,null,null,null,null,null,null,null,null,null,null,null,null,null,null,null,null,null,0,0,{"$f":"IF(OR(AA12=\"\",COUNTIFS($AB$11:$AB$38,AA12)=1),\"\",SUMIFS($G$11:$G$600,$B$11:$B$600,AA12)+ROW(AA12)*0.0001)","v":""},"",{"$f":"IFERROR(LARGE($AC$11:$AC$207,ROW(AC12)-10),\"\")","v":""},{"$f":"IFERROR(SUMIFS($H$11:$H$599,$B$11:$B$599,AD12),\"\")","v":0},{"$f":"IFERROR(SUMIFS($G$11:$G$599,$B$11:$B$599,AD12,$C$11:$C$599,\"6_Implemented\")+SUMIFS($G$11:$G$599,$B$11:$B$599,AD12,$C$11:$C$599,\"5_Readay\"),\"\")","v":0},{"$f":"IFERROR(MAX(AE12-AF12,0),\"\")","v":""},{"$f":"IFERROR(MAX(AF12-AE12,0),\"\")","v":""},null,"","","","","","","","","","","","","","","","","","","","","","","","","","","","","","","","","","","","","","","","","","","","","","","","","","","","","","","","","","","","","","","","","","","","","","","","","","","","","","","","","","","","","","","","","","","","","","","","","","","","","","","","","","","","","","","","","","","","","","","","","","","","","","","","","","","","","","","","","","","","","","","","","","","","","","",null,null,null,null,"Enköping",34.001300000000001,0.4,13.600520000000001]
[null,null,null,null,null,null,null,null,null,null,null,null,null,null,null,null,null,null,null,null,null,null,null,null,null,null,null,"Internt","","","",0,0,"","",null,"","","","","","","","","","","","","","","","","","","","","","","","","","","","","","","","","","","","","","","","","","","","","","","","","","","","","","","","","","","","","","","","","","","","","","","","","","","","","","","","","","","","","","","","","","","","","","","","","","","","","","","","","","","","","","","","","","","","","","","","","","","","","","","","","","","","","","","","","","","","","","","","","","","","","","",null,null,null,null,"Landshypotek",25.001999999999999,0.4,10.0008]
[null,null,null,null,null,null,null,null,null,null,null,null,null,null,null,null,null,null,null,null,null,null,null,null,null,null,null,"XLD_Internal","","","",0,0,"","",null,"","","","","","","","","","","","","","","","","","","","","","","","","","","","","","","","","","","","","","","","","","","","","","","","","","","","","","","","","","","","","","","","","","","","","","","","","","","","","","","","","","","","","","","","","","","","","","","","","","","","","","","","","","","","","","","","","","","","","","","","","","","","","","","","","","","","","","","","","","","","","","","","","","","","","","",null,null,null,null,"XLD_Course",21.003299999999999,1,21.003299999999999]
[null,null,null,null,null,null,null,null,null,null,null,null,null,null,null,null,null,null,null,null,null,null,null,null,null,null,null,"StaffPlanning","","","",0,0,"","",null,"","","","","","","","","","","","","","","","","","","","","","","","","","","","","","","","","","","","","","","","","","","","","","","","","","","","","","","","","","","","","","","","","","","","","","","","","","","","","","","","","","","","","","","","","","","","","","","","","","","","","","","","","","","","","","","","","","","","","","","","","","","","","","","","","","","","","","","","","","","","","","","","","","","","","","",null,null,null,null,"Lasingoo",6,1,6]
[null,null,null,null,null,null,null,null,null,null,null,null,null,null,null,null,null,null,null,null,null,null,null,null,null,null,null,null,"","","",0,0,"","",null,"","","","","","","","","","","","","","","","","","","","","","","","","","","","","","","","","","","","","","","","","","","","","","","","","","","","","","","","","","","","","","","","","","","","","","","","","","","","","","","","","","","","","","","","","","","","","","","","","","","","","","","","","","","","","","","","","","","","","","","","","","","","","","","","","","","","","","","","","","","","","","","","","","","","","","",null,null,null,null,"Company_12Periodisk",10.503,1,10.503]
[null,null,null,null,null,null,null,null,null,null,null,null,null,null,null,null,null,null,null,null,null,null,null,null,null,null,null,null,"","","",0,0,"","",null,"","","","","","","","","","","","","","","","","","","","","","","","","","","","","","","","","","","","","","","","","","","","","","","","","","","","","","","","","","","","","","","","","","","","","","","","","","","","","","","","","","","","","","","","","","","","","","","","","","","","","","","","","","","","","","","","","","","","","","","","","","","","","","","","","","","","","","","","","","","","","","","","","","","","","","",null,null,null,null,"WeAndWine",3.7530999999999999,1,3.7530999999999999]
[null,null,null,null,null,null,null,null,null,null,null,null,null,null,null,null,null,null,null,null,null,null,null,null,null,null,null,null,"","","",0,0,"","",null,"","","","","","","","","","","","","","","","","","","","","","","","","","","","","","","","","","","","","","","","","","","","","","","","","","","","","","","","","","","","","","","","","","","","","","","","","","","","","","","","","","","","","","","","","","","","","","","","","","","","","","","","","","","","","","","","","","","","","","","","","","","","","","","","","","","","","","","","","","","","","","","","","","","","","","",null,null,null,null,"XLD_Marketing",6.0034999999999998,0,0]
[null,null,null,null,null,null,null,null,null,null,null,null,null,null,null,null,null,null,null,null,null,null,null,null,null,null,null,null,"","","",0,0,"","",null,"","","","","","","","","","","","","","","","","","","","","","","","","","","","","","","","","","","","","","","","","","","","","","","","","","","","","","","","","","","","","","","","","","","","","","","","","","","","","","","","","","","","","","","","","","","","","","","","","","","","","","","","","","","","","","","","","","","","","","","","","","","","","","","","","","","","","","","","","","","","","","","","","","","","","","",null,null,null,null,"teknikutveckling-bv",6,0.5,3]
[null,null,null,null,null,null,null,null,null,null,null,null,null,null,null,null,null,null,null,null,null,null,null,null,null,null,null,null,"","","",0,0,"","",null,"","","","","","","","","","","","","","","","","","","","","","","","","","","","","","","","","","","","","","","","","","","","","","","","","","","","","","","","","","","","","","","","","","","","","","","","","","","","","","","","","","","","","","","","","","","","","","","","","","","","","","","","","","","","","","","","","","","","","","","","","","","","","","","","","","","","","","","","","","","","","","","","","","","","","","",null,null,null,null,"Company_13",6,0.5,3]
[null,null,null,null,null,null,null,null,null,null,null,null,null,null,null,null,null,null,null,null,null,null,null,null,null,null,null,null,"","","",0,0,"","",null,"","","","","","","","","","","","","","","","","","","","","","","","","","","","","","","","","","","","","","","","","","","","","","","","","","","","","","","","","","","","","","","","","","","","","","","","","","","","","","","","","","","","","","","","","","","","","","","","","","","","","","","","","","","","","","","","","","","","","","","","","","","","","","","","","","","","","","","","","","","","","","","","","","","","","","",null,null,null,null,"Company_5",5,0.5,2.5]
[null,null,null,null,null,null,null,null,null,null,null,null,null,null,null,null,null,null,null,null,null,null,null,null,null,null,null,null,"","","",0,0,"","",null,"","","","","","","","","","","","","","","","","","","","","","","","","","","","","","","","","","","","","","","","","","","","","","","","","","","","","","","","","","","","","","","","","","","","","","","","","","","","","","","","","","","","","","","","","","","","","","","","","","","","","","","","","","","","","","","","","","","","","","","","","","","","","","","","","","","","","","","","","","","","","","","","","","","","","","",null,null,null,null,"PriceGainInternal",20,0.5,10]
[null,null,null,null,null,null,null,null,null,null,null,null,null,null,null,null,null,null,null,null,null,null,null,null,null,null,null,null,"","","",0,0,"","",null,"","","","","","","","","","","","","","","","","","","","","","","","","","","","","","","","","","","","","","","","","","","","","","","","","","","","","","","","","","","","","","","","","","","","","","","","","","","","","","","","","","","","","","","","","","","","","","","","","","","","","","","","","","","","","","","","","","","","","","","","","","","","","","","","","","","","","","","","","","","","","","","","","","","","","","",null,null,null,null,"Company_13",10,0.5,5]
[null,null,null,null,null,null,null,null,null,null,null,null,null,null,null,null,null,null,null,null,null,null,null,null,null,null,null,null,"","","",0,0,"","",null,"","","","","","","","","","","","","","","","","","","","","","","","","","","","","","","","","","","","","","","","","","","","","","","","","","","","","","","","","","","","","","","","","","","","","","","","","","","","","","","","","","","","","","","","","","","","","","","","","","","","","","","","","","","","","","","","","","","","","","","","","","","","","","","","","","","","","","","","","","","","","","","","","","","","","","",null,null,null,null,"PriceGainInternal",20,0.5,10]
[null,null,null,null,null,null,null,null,null,null,null,null,null,null,null,null,null,null,null,null,null,null,null,null,null,null,null,null,"","","",0,0,"","",null,"","","","","","","","","","","","","","","","","","","","","","","","","","","","","","","","","","","","","","","","","","","","","","","","","","","","","","","","","","","","","","","","","","","","","","","","","","","","","","","","","","","","","","","","","","","","","","","","","","","","","","","","","","","","","","","","","","","","","","","","","","","","","","","","","","","","","","","","","","","","","","","","","","","","","","",null,null,null,null,"Company_11",10,0.5,5]
[null,null,null,null,null,null,null,null,null,null,null,null,null,null,null,null,null,null,null,null,null,null,null,null,null,null,null,null,"","","",0,0,"","",null,"","","","","","","","","","","","","","","",{"$f":"IF($AD26=\"\",\"\",IF(AZ$10<=$AG26,\"Finished\",IF(AZ$10<=MIN($AE26,$AF26),\"Actual\",IF(AZ$10<=$AE26,\"BudgetLeft\",IF(AZ$10<=$AF26,\"BudgetOver\",\"\")))))","v":""},"","","","","","","","","","","","","","","","","","","","","","","","","","","","","","","",{"$f":"IF($AD26=\"\",\"\",IF(CF$10<=$AG26,\"Finished\",IF(CF$10<=MIN($AE26,$AF26),\"Actual\",IF(CF$10<=$AE26,\"BudgetLeft\",IF(CF$10<=$AF26,\"BudgetOver\",\"\")))))","v":""},{"$f":"IF($AD26=\"\",\"\",IF(CG$10<=$AG26,\"Finished\",IF(CG$10<=MIN($AE26,$AF26),\"Actual\",IF(CG$10<=$AE26,\"BudgetLeft\",IF(CG$10<=$AF26,\"BudgetOver\",\"\")))))","v":""},{"$f":"IF($AD26=\"\",\"\",IF(CH$10<=$AG26,\"Finished\",IF(CH$10<=MIN($AE26,$AF26),\"Actual\",IF(CH$10<=$AE26,\"BudgetLeft\",IF(CH$10<=$AF26,\"BudgetOver\",\"\")))))","v":""},"","","","","","","","","","","","","","","","","","","","","","","","","","","","","",{"$f":"IF($AD26=\"\",\"\",IF(DL$10<=$AG26,\"Finished\",IF(DL$10<=MIN($AE26,$AF26),\"Actual\",IF(DL$10<=$AE26,\"BudgetLeft\",IF(DL$10<=$AF26,\"BudgetOver\",\"\")))))","v":""},"","","","","","","","","","","","","","","",{"$f":"IF($AD26=\"\",\"\",IF(EB$10<=$AG26,\"Finished\",IF(EB$10<=MIN($AE26,$AF26),\"Actual\",IF(EB$10<=$AE26,\"BudgetLeft\",IF(EB$10<=$AF26,\"BudgetOver\",\"\")))))","v":""},"","","","","","","","","","","","","","","","","","","","","","","","","","","","","","","",{"$f":"IF($AD26=\"\",\"\",IF(FH$10<=$AG26,\"Finished\",IF(FH$10<=MIN($AE26,$AF26),\"Actual\",IF(FH$10<=$AE26,\"BudgetLeft\",IF(FH$10<=$AF26,\"BudgetOver\",\"\")))))","v":""},{"$f":"IF($AD26=\"\",\"\",IF(FI$10<=$AG26,\"Finished\",IF(FI$10<=MIN($AE26,$AF26),\"Actual\",IF(FI$10<=$AE26,\"BudgetLeft\",IF(FI$10<=$AF26,\"BudgetOver\",\"\")))))","v":""},{"$f":"IF($AD26=\"\",\"\",IF(FJ$10<=$AG26,\"Finished\",IF(FJ$10<=MIN($AE26,$AF26),\"Actual\",IF(FJ$10<=$AE26,\"BudgetLeft\",IF(FJ$10<=$AF26,\"BudgetOver\",\"\")))))","v":""},"","","","","","","","","","","","","","","","","","","","",null,null,null,null,"Company_2",20,0.5,10]
[null,null,null,null,null,null,null,null,null,null,null,null,null,null,null,null,null,null,null,null,null,null,null,null,null,null,null,null,"","","",0,0,"","",null,{"$f":"IF($AD27=\"\",\"\",IF(AK$10<=$AG27,\"Finished\",IF(AK$10<=MIN($AE27,$AF27),\"Actual\",IF(AK$10<=$AE27,\"BudgetLeft\",IF(AK$10<=$AF27,\"BudgetOver\",\"\")))))","v":""},"","","","","","","","","","","","","","","","","","","","","","","","","",{"$f":"IF($AD27=\"\",\"\",IF(BK$10<=$AG27,\"Finished\",IF(BK$10<=MIN($AE27,$AF27),\"Actual\",IF(BK$10<=$AE27,\"BudgetLeft\",IF(BK$10<=$AF27,\"BudgetOver\",\"\")))))","v":""},"","","","","","","","","","","","","","","",{"$f":"IF($AD27=\"\",\"\",IF(CA$10<=$AG27,\"Finished\",IF(CA$10<=MIN($AE27,$AF27),\"Actual\",IF(CA$10<=$AE27,\"BudgetLeft\",IF(CA$10<=$AF27,\"BudgetOver\",\"\")))))","v":""},"","","","","","","","","","","","","","","",{"$f":"IF($AD27=\"\",\"\",IF(CQ$10<=$AG27,\"Finished\",IF(CQ$10<=MIN($AE27,$AF27),\"Actual\",IF(CQ$10<=$AE27,\"BudgetLeft\",IF(CQ$10<=$AF27,\"BudgetOver\",\"\")))))","v":""},"","","","","","","","","","","","","","","",{"$f":"IF($AD27=\"\",\"\",IF(DG$10<=$AG27,\"Finished\",IF(DG$10<=MIN($AE27,$AF27),\"Actual\",IF(DG$10<=$AE27,\"BudgetLeft\",IF(DG$10<=$AF27,\"BudgetOver\",\"\")))))","v":""},"","","","","","","","","","","","","","","","","","","","","","","","","","","","","","","",{"$f":"IF($AD27=\"\",\"\",IF(EM$10<=$AG27,\"Finished\",IF(EM$10<=MIN($AE27,$AF27),\"Actual\",IF(EM$10<=$AE27,\"BudgetLeft\",IF(EM$10<=$AF27,\"BudgetOver\",\"\")))))","v":""},"","","","","","","","","","","","","","","",{"$f":"IF($AD27=\"\",\"\",IF(FC$10<=$AG27,\"Finished\",IF(FC$10<=MIN($AE27,$AF27),\"Actual\",IF(FC$10<=$AE27,\"BudgetLeft\",IF(FC$10<=$AF27,\"BudgetOver\",\"\")))))","v":""},"","","","","","","","","","","","","","","",{"$f":"IF($AD27=\"\",\"\",IF(FS$10<=$AG27,\"Finished\",IF(FS$10<=MIN($AE27,$AF27),\"Actual\",IF(FS$10<=$AE27,\"BudgetLeft\",IF(FS$10<=$AF27,\"BudgetOver\",\"\")))))","v":""},"","","","","","","","","","","",null,null,null,null,"Company_5New",5,0.5,2.5]
[null,null,null,null,null,null,null,null,null,null,null,null,null,null,null,null,null,null,null,null,null,null,null,null,null,null,null,null,"","","",0,0,"","",null,"","","","","","","","","","","","","","","","","","","","","","","","","","","","","","","","","","","","","","","","","","","","","","","","","","","","","","","","","","","","","","","","","","","","","","","","","","","","","","","","","","","","","","","","","","","","","","","","","","","","","","","","","","","","","","","","","","","","","","","","","","","","","","","","","","","","","","","","","","","","","","","","","","","","","","",null,null,null,null,"Company_1",19.7,0.9,17.73]
[null,null,null,null,null,null,null,null,null,null,null,null,null,null,null,null,null,null,null,null,null,null,null,null,null,null,null,null,"","","",0,0,"","",null,"","","","","","","","","","","","","","","","","","","","","","","","","","","","","","","","","","","","","","","","","","","","","","","","","","","","","","","","","","","","","","","","","","","","","","","","","","","","","","","","","","","","","","","","","","","","","","","","","","","","","","","","","","","","","","","","","","","","","","","","","","","","","","","","","","","","","","","","","","","","","","","","","","","","","","",null,null,null,null,"Company_8",15,0.9,{"$f":"GK29*GJ29","v":13.5}]
[null,null,null,null,null,null,null,null,null,null,null,null,null,null,null,null,null,null,null,null,null,null,null,null,null,null,null,null,"","","",0,0,"","",null,"","","","","","","","","","","","","","","","","","","","","","","","","","","","","","","","","","","","","","","","","","","","","","","","","","","","","","","","","","","","","","","","","","","","","","","","","","","","","","","","","","","","","","","","","","","","","","","","","","","","","","","","","","","","","","","","","","","","","","","","","","","","","","","","","","","","","","","","","","","","","","","","","","","","","","",null,null,null,null,"JobbEntren",25,0.7,{"$f":"GK30*GJ30","v":17.5}]
[null,null,null,null,null,null,null,null,null,null,null,null,null,null,null,null,null,null,null,null,null,null,null,null,null,null,null,null,"","","",0,0,"","",null,"","","","","","","","","","","","","","","","","","","","","","","","","","","","","","","","","","","","","","","","","","","","","","","","","","","","","","","","","","","","","","","","","","","","","","","","","","","","","","","","","","","","","","","","","","","","","","","","","","","","","","","","","","","","","","","","","","","","","","","","","","","","","","","","","","","","","","","","","","","","","","","","","","","","","",""]
[null,null,null,null,null,null,null,null,null,null,null,null,null,null,null,null,null,null,null,null,null,null,null,null,null,null,null,null,"","","",0,0,"","",null,"","","","","","","","","","","","","","","","","","","","","","","","","","","","","","","","","","","","","","","","","","","","","","","","","","","","","","","","","","","","","","","","","","","","","","","","","","","","","","","","","","","","","","","","","","","","","","","","","","","","","","","","","","","","","","","","","","","","","","","","","","","","","","","","","","","","","","","","","","","","","","","","","","","","","",""]
[null,null,null,null,null,null,null,null,null,null,null,null,null,null,null,null,null,null,null,null,null,null,null,null,null,null,null,null,"","","",0,0,"","",null,"","","","","","","","","","","","","","","","","","","","","","","","","","","","","","","","","","","","","","","","","","","","","","","","","","","","","","","","","","","","","","","","","","","","","","","","","","","","","","","","","","","","","","","","","","","","","","","","","","","","","","","","","","","","","","","","","","","","","","","","","","","","","","","","","","","","","","","","","","","","","","","","","","","","","",""]
[null,null,null,null,null,null,null,null,null,null,null,null,null,null,null,null,null,null,null,null,null,null,null,null,null,null,null,null,"","","",0,0,"","",null,"","","","","","","","","","","","","","","","","","","","","","","","","","","","","","","","","","","","","","","","","","","","","","","","","","","","","","","","","","","","","","","","","","","","","","","","","","","","","","","","","","","","","","","","","","","","","","","","","","","","","","","","","","","","","","","","","","","","","","","","","","","","","","","","","","","","","","","","","","","","","","","","","","","","","",""]
[null,null,null,null,null,null,null,null,null,null,null,null,null,null,null,null,null,null,null,null,null,null,null,null,null,null,null,null,"","","",0,0,"","",null,"","","","","","","","","","","","","","","","","","","","","","","","","","","","","","","","","","","","","","","","","","","","","","","","","","","","","","","","","","","","","","","","","","","","","","","","","","","","","","","","","","","","","","","","","","","","","","","","","","","","","","","","","","","","","","","","","","","","","","","","","","","","","","","","","","","","","","","","","","","","","","","","","","","","","",""]
[null,null,null,null,null,null,null,null,null,null,null,null,null,null,null,null,null,null,null,null,null,null,null,null,null,null,null,null,"","","",0,0,"","",null,"","","","","","","","","","","","","","","","","","","","","","","","","","","","","","","","","","","","","","","","","","","","","","","","","","","","","","","","","","","","","","","","","","","","","","","","","","","","","","","","","","","","","","","","","","","","","","","","","","","","","","","","","","","","","","","","","","","","","","","","","","","","","","","","","","","","","","","","","","","","","","","","","","","","","",""]
[null,null,null,null,null,null,null,null,null,null,null,null,null,null,null,null,null,null,null,null,null,null,null,null,null,null,null,null,"","","",0,0,"","",null,"","","","","","","","","","","","","","","","","","","","","","","","","","","","","","","","","","","","","","","","","","","","","","","","","","","","","","","","","","","","","","","","","","","","","","","","","","","","","","","","","","","","","","","","","","","","","","","","","","","","","","","","","","","","","","","","","","","","","","","","","","","","","","","","","","","","","","","","","","","","","","","","","","","","","",""]
[null,null,null,null,null,null,null,null,null,null,null,null,null,null,null,null,null,null,null,null,null,null,null,null,null,null,null,null,"","","",0,0,"","",null,"","","","","","","","","","","","","","","","","","","","","","","","","","","","","","","","","","","","","","","","","","","","","","","","","","","","","","","","","","","","","","","","","","","","","","","","","","","","","","","","","","","","","","","","","","","","","","","","","","","","","","","","","","","","","","","","","","","","","","","","","","","","","","","","","","","","","","","","","","","","","","","","","","","","","",""]
[null,null,null,null,null,null,null,null,null,null,null,null,null,null,null,null,null,null,null,null,null,null,null,null,null,null,null,null,"","","",0,0,"","",null,"","","","","","","","","","","","","","","","","","","","","","","","","","","","","","","","","","","","","","","","","","","","","","","","","","","","","","","","","","","","","","","","","","","","","","","","","","","","","","","","","","","","","","","","","","","","","","","","","","","","","","","","","","","","","","","","","","","","","","","","","","","","","","","","","","","","","","","","","","","","","","","","","","","","","",""]
[null,null,null,null,null,null,null,null,null,null,null,null,null,null,null,null,null,null,null,null,null,null,null,null,null,null,null,null,"","","",0,0,"","",null,"","","","","","","","","","","","","","","","","","","","","","","","","","","","","","","","","","","","","","","","","","","","","","","","","","","","","","","","","","","","","","","","","","","","","","","","","","","","","","","","","","","","","","","","","","","","","","","","","","","","","","","","","","","","","","","","","","","","","","","","","","","","","","","","","","","","","","","","","","","","","","","","","","","","","",""]
[null,null,null,null,null,null,null,null,null,null,null,null,null,null,null,null,null,null,null,null,null,null,null,null,null,null,null,null,"","","",0,0,"","",null,"","","","","","","","","","","","","","","","","","","","","","","","","","","","","","","","","","","","","","","","","","","","","","","","","","","","","","","","","","","","","","","","","","","","","","","","","","","","","","","","","","","","","","","","","","","","","","","","","","","","","","","","","","","","","","","","","","","","","","","","","","","","","","","","","","","","","","","","","","","","","","","","","","","","","",""]
[null,null,null,null,null,null,null,null,null,null,null,null,null,null,null,null,null,null,null,null,null,null,null,null,null,null,null,null,"","","",0,0,"","",null,"","","","","","","","","","","","","","","","",{"$f":"IF($AD42=\"\",\"\",IF(BA$10<=$AG42,\"Finished\",IF(BA$10<=MIN($AE42,$AF42),\"Actual\",IF(BA$10<=$AE42,\"BudgetLeft\",IF(BA$10<=$AF42,\"BudgetOver\",\"\")))))","v":""},"","","","","","","","","","","","","","","","","","","","","","","","","","","","","","","","","","","","","","","","",{"$f":"IF($AD42=\"\",\"\",IF(CP$10<=$AG42,\"Finished\",IF(CP$10<=MIN($AE42,$AF42),\"Actual\",IF(CP$10<=$AE42,\"BudgetLeft\",IF(CP$10<=$AF42,\"BudgetOver\",\"\")))))","v":""},{"$f":"IF($AD42=\"\",\"\",IF(CQ$10<=$AG42,\"Finished\",IF(CQ$10<=MIN($AE42,$AF42),\"Actual\",IF(CQ$10<=$AE42,\"BudgetLeft\",IF(CQ$10<=$AF42,\"BudgetOver\",\"\")))))","v":""},{"$f":"IF($AD42=\"\",\"\",IF(CR$10<=$AG42,\"Finished\",IF(CR$10<=MIN($AE42,$AF42),\"Actual\",IF(CR$10<=$AE42,\"BudgetLeft\",IF(CR$10<=$AF42,\"BudgetOver\",\"\")))))","v":""},"","","","","","","","","","","","","","","","","","","","","","","","","","","","","",{"$f":"IF($AD42=\"\",\"\",IF(DV$10<=$AG42,\"Finished\",IF(DV$10<=MIN($AE42,$AF42),\"Actual\",IF(DV$10<=$AE42,\"BudgetLeft\",IF(DV$10<=$AF42,\"BudgetOver\",\"\")))))","v":""},"","","","","","","","","","","","","","","",{"$f":"IF($AD42=\"\",\"\",IF(EL$10<=$AG42,\"Finished\",IF(EL$10<=MIN($AE42,$AF42),\"Actual\",IF(EL$10<=$AE42,\"BudgetLeft\",IF(EL$10<=$AF42,\"BudgetOver\",\"\")))))","v":""},"","","","","","","","","","","","","","","","","","","","","","","","","","","","","","","",{"$f":"IF($AD42=\"\",\"\",IF(FR$10<=$AG42,\"Finished\",IF(FR$10<=MIN($AE42,$AF42),\"Actual\",IF(FR$10<=$AE42,\"BudgetLeft\",IF(FR$10<=$AF42,\"BudgetOver\",\"\")))))","v":""},{"$f":"IF($AD42=\"\",\"\",IF(FS$10<=$AG42,\"Finished\",IF(FS$10<=MIN($AE42,$AF42),\"Actual\",IF(FS$10<=$AE42,\"BudgetLeft\",IF(FS$10<=$AF42,\"BudgetOver\",\"\")))))","v":""},{"$f":"IF($AD42=\"\",\"\",IF(FT$10<=$AG42,\"Finished\",IF(FT$10<=MIN($AE42,$AF42),\"Actual\",IF(FT$10<=$AE42,\"BudgetLeft\",IF(FT$10<=$AF42,\"BudgetOver\",\"\")))))","v":""},"","","","","","","","","",""]
[null,null,null,null,null,null,null,null,null,null,null,null,null,null,null,null,null,null,null,null,null,null,null,null,null,null,null,null,"","","",0,0,"","",null,{"$f":"IF($AD43=\"\",\"\",IF(AK$10<=$AG43,\"Finished\",IF(AK$10<=MIN($AE43,$AF43),\"Actual\",IF(AK$10<=$AE43,\"BudgetLeft\",IF(AK$10<=$AF43,\"BudgetOver\",\"\")))))","v":""},"","","","","","","","","","","","","","","","","","","","","","","","","","","","","","","",{"$f":"IF($AD43=\"\",\"\",IF(BQ$10<=$AG43,\"Finished\",IF(BQ$10<=MIN($AE43,$AF43),\"Actual\",IF(BQ$10<=$AE43,\"BudgetLeft\",IF(BQ$10<=$AF43,\"BudgetOver\",\"\")))))","v":""},"","","","","","","","","","","","","","","",{"$f":"IF($AD43=\"\",\"\",IF(CG$10<=$AG43,\"Finished\",IF(CG$10<=MIN($AE43,$AF43),\"Actual\",IF(CG$10<=$AE43,\"BudgetLeft\",IF(CG$10<=$AF43,\"BudgetOver\",\"\")))))","v":""},"","","","","","","","","","","","","","","",{"$f":"IF($AD43=\"\",\"\",IF(CW$10<=$AG43,\"Finished\",IF(CW$10<=MIN($AE43,$AF43),\"Actual\",IF(CW$10<=$AE43,\"BudgetLeft\",IF(CW$10<=$AF43,\"BudgetOver\",\"\")))))","v":""},"","","","","","","","","","","","","","","",{"$f":"IF($AD43=\"\",\"\",IF(DM$10<=$AG43,\"Finished\",IF(DM$10<=MIN($AE43,$AF43),\"Actual\",IF(DM$10<=$AE43,\"BudgetLeft\",IF(DM$10<=$AF43,\"BudgetOver\",\"\")))))","v":""},"","","","","","","","","","","","","","","","","","","","","","","","","","","","","","","","","","","",{"$f":"IF($AD43=\"\",\"\",IF(EW$10<=$AG43,\"Finished\",IF(EW$10<=MIN($AE43,$AF43),\"Actual\",IF(EW$10<=$AE43,\"BudgetLeft\",IF(EW$10<=$AF43,\"BudgetOver\",\"\")))))","v":""},"","","","","","","","","","","","","","","",{"$f":"IF($AD43=\"\",\"\",IF(FM$10<=$AG43,\"Finished\",IF(FM$10<=MIN($AE43,$AF43),\"Actual\",IF(FM$10<=$AE43,\"BudgetLeft\",IF(FM$10<=$AF43,\"BudgetOver\",\"\")))))","v":""},"","","","","","","","","","","","","","","",{"$f":"IF($AD43=\"\",\"\",IF(GC$10<=$AG43,\"Finished\",IF(GC$10<=MIN($AE43,$AF43),\"Actual\",IF(GC$10<=$AE43,\"BudgetLeft\",IF(GC$10<=$AF43,\"BudgetOver\",\"\")))))","v":""},""]
[null,null,null,null,null,null,null,null,null,null,null,null,null,null,null,null,null,null,null,null,null,null,null,null,null,null,null,null,"","","",0,0,"","",null,"","","","","","","","","","","","","","","","","","","","","","","","","","","","","","","","","","","","","","","","","","","","","","","","","","","","","","","","","","","","","","","","","","","","","","","","","","","","","","","","","","","","","","","","","","","","","","","","","","","","","","","","","","","","","","","","","","","","","","","","","","","","","","","","","","","","","","","","","","","","","","","","","","","","","",""]
[null,null,null,null,null,null,null,null,null,null,null,null,null,null,null,null,null,null,null,null,null,null,null,null,null,null,null,null,"","","",0,0,"","",null,"","","","","","","","","","","","","","","","","","","","","","","","","","","","","","","","","","","","","","","","","","","","","","","","","","","","","","","","","","","","","","","","","","","","","","","","","","","","","","","","","","","","","","","","","","","","","","","","","","","","","","","","","","","","","","","","","","","","","","","","","","","","","","","","","","","","","","","","","","","","","","","","","","","","","",""]
[null,null,null,null,null,null,null,null,null,null,null,null,null,null,null,null,null,null,null,null,null,null,null,null,null,null,null,null,"","","",0,0,"","",null,"","","","","","","","","","","","","","","","","","","","","","","","","","","","","","","","","","","","","","","","","","","","","","","","","","","","","","","","","","","","","","","","","","","","","","","","","","","","","","","","","","","","","","","","","","","","","","","","","","","","","","","","","","","","","","","","","","","","","","","","","","","","","","","","","","","","","","","","","","","","","","","","","","","","","",""]
[null,null,null,null,null,null,null,null,null,null,null,null,null,null,null,null,null,null,null,null,null,null,null,null,null,null,null,null,"","","",0,0,"","",null,"","","","","","","","","","","","","","","","","","","","","","","","","","","","","","","","","","","","","","","","","","","","","","","","","","","","","","","","","","","","","","","","","","","","","","","","","","","","","","","","","","","","","","","","","","","","","","","","","","","","","","","","","","","","","","","","","","","","","","","","","","","","","","","","","","","","","","","","","","","","","","","","","","","","","",""]
[null,null,null,null,null,null,null,null,null,null,null,null,null,null,null,null,null,null,null,null,null,null,null,null,null,null,null,null,"","","",0,0,"","",null,"","","","","","","","","","","","","","","","","","","","","","","","","","","","","","","","","","","","","","","","","","","","","","","","","","","","","","","","","","","","","","","","","","","","","","","","","","","","","","","","","","","","","","","","","","","","","","","","","","","","","","","","","","","","","","","","","","","","","","","","","","","","","","","","","","","","","","","","","","","","","","","","","","","","","",""]
[null,null,null,null,null,null,null,null,null,null,null,null,null,null,null,null,null,null,null,null,null,null,null,null,null,null,null,null,"","","",0,0,"","",null,"","","","","","","","","","","","","","","","","","","","","","","","","","","","","","","","","","","","","","","","","","","","","","","","","","","","","","","","","","","","","","","","","","","","","","","","","","","","","","","","","","","","","","","","","","","","","","","","","","","","","","","","","","","","","","","","","","","","","","","","","","","","","","","","","","","","","","","","","","","","","","","","","","","","","",""]
[null,null,null,null,null,null,null,null,null,null,null,null,null,null,null,null,null,null,null,null,null,null,null,null,null,null,null,null,"","","",0,0,"","",null,"","","","","","","","","","","","","","","","","","","","","","","","","","","","","","","","","","","","","","","","","","","","","","","","","","","","","","","","","","","","","","","","","","","","","","","","","","","","","","","","","","","","","","","","","","","","","","","","","","","","","","","","","","","","","","","","","","","","","","","","","","","","","","","","","","","","","","","","","","","","","","","","","","","","","",""]
[null,null,null,null,null,null,null,null,null,null,null,null,null,null,null,null,null,null,null,null,null,null,null,null,null,null,null,null,"","","",0,0,"","",null,"","","","","","","","","","","","","","","","","","","","","","","","","","","","","","","","","","","","","","","","","","","","","","","","","","","","","","","","","","","","","","","","","","","","","","","","","","","","","","","","","","","","","","","","","","","","","","","","","","","","","","","","","","","","","","","","","","","","","","","","","","","","","","","","","","","","","","","","","","","","","","","","","","","","","",""]
[null,null,null,null,null,null,null,null,null,null,null,null,null,null,null,null,null,null,null,null,null,null,null,null,null,null,null,null,"","","",0,0,"","",null,"","","","","","","","","","","","","","","","","","","","","","","","","","","","","","","","","","","","","","","","","","","","","","","","","","","","","","","","","","","","","","","","","","","","","","","","","","","","","","","","","","","","","","","","","","","","","","","","","","","","","","","","","","","","","","","","","","","","","","","","","","","","","","","","","","","","","","","","","","","","","","","","","","","","","",""]
[null,null,null,null,null,null,null,null,null,null,null,null,null,null,null,null,null,null,null,null,null,null,null,null,null,null,null,null,"","","",0,0,"","",null,"","","","","","","","","","","","","","","","","","","","","","","","","","","","","","","","","","","","","","","","","","","","","","","","","","","","","","","","","","","","","","","","","","","","","","","","","","","","","","","","","","","","","","","","","","","","","","","","","","","","","","","","","","","","","","","","","","","","","","","","","","","","","","","","","","","","","","","","","","","","","","","","","","","","","",""]
[null,null,null,null,null,null,null,null,null,null,null,null,null,null,null,null,null,null,null,null,null,null,null,null,null,null,null,null,"","","",0,0,"","",null,"","","","","","","","","","","","","","","","","","","","","","","","","","","","","","","","","","","","","","","","","","","","","","","","","","","","","","","","","","","","","","","","","","","","","","","","","","","","","","","","","","","","","","","","","","","","","","","","","","","","","","","","","","","","","","","","","","","","","","","","","","","","","","","","","","","","","","","","","","","","","","","","","","","","","",""]
[null,null,null,null,null,null,null,null,null,null,null,null,null,null,null,null,null,null,null,null,null,null,null,null,null,null,null,null,"","","",0,0,"","",null,"","","","","","","","","","","","","","","","","","","","","","","","","","","","","","","","","","","","","","","","","","","","","","","","","","","","","","","","","","","","","","","","","","","","","","","","","","","","","","","","","","","","","","","","","","","","","","","","","","","","","","","","","","","","","","","","","","","","","","","","","","","","","","","","","","","","","","","","","","","","","","","","","","","","","",""]
[null,null,null,null,null,null,null,null,null,null,null,null,null,null,null,null,null,null,null,null,null,null,null,null,null,null,null,null,"","","",0,0,"","",null,"","","","","","","","","","","","","","","","","","","","","","","","","","","","","","","","","","","","","","","","","","","","","","","","","","","","","","","","","","","","","","","","","","","","","","","","","","","","","","","","","","","","","","","","","","","","","","","","","","","","","","","","","","","","","","","","","","","","","","","","","","","","","","","","","","","","","","","","","","","","","","","","","","","","","",""]
[null,null,null,null,null,null,null,null,null,null,null,null,null,null,null,null,null,null,null,null,null,null,null,null,null,null,null,null,"","","",0,0,"","",null,"","","","","","","","","","","","","","","","","","","","","","","","","","","","","","","","","","","","","","","","","","","","","","","","","","","","","","","","","","","","","","","","","","","","","","","","","","","","","","","","","","","","","","","","","","","","","","","","","","","","","","","","","","","","","","","","","","","","","","","","","","","","","","","","","","","","","","","","","","","","","","","","","","","","","",""]
[null,null,null,null,null,null,null,null,null,null,null,null,null,null,null,null,null,null,null,null,null,null,null,null,null,null,null,null,"","","",0,0,"","",null,"","","","","","","","","","","","","","","",{"$f":"IF($AD58=\"\",\"\",IF(AZ$10<=$AG58,\"Finished\",IF(AZ$10<=MIN($AE58,$AF58),\"Actual\",IF(AZ$10<=$AE58,\"BudgetLeft\",IF(AZ$10<=$AF58,\"BudgetOver\",\"\")))))","v":""},"","","","","","","","","","","","","","","",{"$f":"IF($AD58=\"\",\"\",IF(BP$10<=$AG58,\"Finished\",IF(BP$10<=MIN($AE58,$AF58),\"Actual\",IF(BP$10<=$AE58,\"BudgetLeft\",IF(BP$10<=$AF58,\"BudgetOver\",\"\")))))","v":""},"","","","","","","","","","","","","","","","","","","","","","","","","","","","","","","",{"$f":"IF($AD58=\"\",\"\",IF(CV$10<=$AG58,\"Finished\",IF(CV$10<=MIN($AE58,$AF58),\"Actual\",IF(CV$10<=$AE58,\"BudgetLeft\",IF(CV$10<=$AF58,\"BudgetOver\",\"\")))))","v":""},"","","","","","","","","","","","","","","","","","","","","","","","","","","","","","","","",{"$f":"IF($AD58=\"\",\"\",IF(EC$10<=$AG58,\"Finished\",IF(EC$10<=MIN($AE58,$AF58),\"Actual\",IF(EC$10<=$AE58,\"BudgetLeft\",IF(EC$10<=$AF58,\"BudgetOver\",\"\")))))","v":""},"","","","","","","","","","","","","","","",{"$f":"IF($AD58=\"\",\"\",IF(ES$10<=$AG58,\"Finished\",IF(ES$10<=MIN($AE58,$AF58),\"Actual\",IF(ES$10<=$AE58,\"BudgetLeft\",IF(ES$10<=$AF58,\"BudgetOver\",\"\")))))","v":""},"","","","","","","","","","","","","","","","","","","","","","","","","","","","","","","","","","",{"$f":"IF($AD58=\"\",\"\",IF(GB$10<=$AG58,\"Finished\",IF(GB$10<=MIN($AE58,$AF58),\"Actual\",IF(GB$10<=$AE58,\"BudgetLeft\",IF(GB$10<=$AF58,\"BudgetOver\",\"\")))))","v":""},{"$f":"IF($AD58=\"\",\"\",IF(GC$10<=$AG58,\"Finished\",IF(GC$10<=MIN($AE58,$AF58),\"Actual\",IF(GC$10<=$AE58,\"BudgetLeft\",IF(GC$10<=$AF58,\"BudgetOver\",\"\")))))","v":""},{"$f":"IF($AD58=\"\",\"\",IF(GD$10<=$AG58,\"Finished\",IF(GD$10<=MIN($AE58,$AF58),\"Actual\",IF(GD$10<=$AE58,\"BudgetLeft\",IF(GD$10<=$AF58,\"BudgetOver\",\"\")))))","v":""}]
[null,null,null,null,null,null,null,null,null,null,null,null,null,null,null,null,null,null,null,null,null,null,null,null,null,null,null,null,"","","",0,0,"","",null,{"$f":"IF($AD59=\"\",\"\",IF(AK$10<=$AG59,\"Finished\",IF(AK$10<=MIN($AE59,$AF59),\"Actual\",IF(AK$10<=$AE59,\"BudgetLeft\",IF(AK$10<=$AF59,\"BudgetOver\",\"\")))))","v":""},"","","","","","","","","","","","","","","","","","","","","","","","","","","","","","","","","","","","","","","","","","","","","",{"$f":"IF($AD59=\"\",\"\",IF(CE$10<=$AG59,\"Finished\",IF(CE$10<=MIN($AE59,$AF59),\"Actual\",IF(CE$10<=$AE59,\"BudgetLeft\",IF(CE$10<=$AF59,\"BudgetOver\",\"\")))))","v":""},"","","","","","","","","","","","","","","","","","","","","","","","","","","","","",{"$f":"IF($AD59=\"\",\"\",IF(DI$10<=$AG59,\"Finished\",IF(DI$10<=MIN($AE59,$AF59),\"Actual\",IF(DI$10<=$AE59,\"BudgetLeft\",IF(DI$10<=$AF59,\"BudgetOver\",\"\")))))","v":""},"","","","","","","","","","","","","","","",{"$f":"IF($AD59=\"\",\"\",IF(DY$10<=$AG59,\"Finished\",IF(DY$10<=MIN($AE59,$AF59),\"Actual\",IF(DY$10<=$AE59,\"BudgetLeft\",IF(DY$10<=$AF59,\"BudgetOver\",\"\")))))","v":""},"","","","","","","","","","","","","","","","","","","","","","","","","","","","","","","","","",{"$f":"IF($AD59=\"\",\"\",IF(FG$10<=$AG59,\"Finished\",IF(FG$10<=MIN($AE59,$AF59),\"Actual\",IF(FG$10<=$AE59,\"BudgetLeft\",IF(FG$10<=$AF59,\"BudgetOver\",\"\")))))","v":""},"","","","","","","","","","","","","","","",{"$f":"IF($AD59=\"\",\"\",IF(FW$10<=$AG59,\"Finished\",IF(FW$10<=MIN($AE59,$AF59),\"Actual\",IF(FW$10<=$AE59,\"BudgetLeft\",IF(FW$10<=$AF59,\"BudgetOver\",\"\")))))","v":""},"","","","","","",""]
[null,null,null,null,null,null,null,null,null,null,null,null,null,null,null,null,null,null,null,null,null,null,null,null,null,null,null,null,"","","",0,0,"","",null,"","","","","","","","","","","","","","","","","","","","","","","","","","","","","","","","","","","","","","","","","","","","","","","","","","","","","","","","","","","","","","","","","","","","","","","","","","","","","","","","","","","","","","","","","","","","","","","","","","","","","","","","","","","","","","","","","","","","","","","","","","","","","","","","","","","","","","","","","","","","","","","","","","","","","",""]
[null,null,null,null,null,null,null,null,null,null,null,null,null,null,null,null,null,null,null,null,null,null,null,null,null,null,null,null,"","","",0,0,"","",null,"","","","","","","","","","","","","","","","","","","","","","","","","","","","","","","","","","","","","","","","","","","","","","","","","","","","","","","","","","","","","","","","","","","","","","","","","","","","","","","","","","","","","","","","","","","","","","","","","","","","","","","","","","","","","","","","","","","","","","","","","","","","","","","","","","","","","","","","","","","","","","","","","","","","","",""]
[null,null,null,null,null,null,null,null,null,null,null,null,null,null,null,null,null,null,null,null,null,null,null,null,null,null,null,null,"","","",0,0,"","",null,"","","","","","","","","","","","","","","","","","","","","","","","","","","","","","","","","","","","","","","","","","","","","","","","","","","","","","","","","","","","","","","","","","","","","","","","","","","","","","","","","","","","","","","","","","","","","","","","","","","","","","","","","","","","","","","","","","","","","","","","","","","","","","","","","","","","","","","","","","","","","","","","","","","","","",""]
[null,null,null,null,null,null,null,null,null,null,null,null,null,null,null,null,null,null,null,null,null,null,null,null,null,null,null,null,"","","",0,0,"","",null,"","","","","","","","","","","","","","","","","","","","","","","","","","","","","","","","","","","","","","","","","","","","","","","","","","","","","","","","","","","","","","","","","","","","","","","","","","","","","","","","","","","","","","","","","","","","","","","","","","","","","","","","","","","","","","","","","","","","","","","","","","","","","","","","","","","","","","","","","","","","","","","","","","","","","",""]
[null,null,null,null,null,null,null,null,null,null,null,null,null,null,null,null,null,null,null,null,null,null,null,null,null,null,null,null,"","","",0,0,"","",null,"","","","","","","","","","","","","","","","","","","","","","","","","","","","","","","","","","","","","","","","","","","","","","","","","","","","","","","","","","","","","","","","","","","","","","","","","","","","","","","","","","","","","","","","","","","","","","","","","","","","","","","","","","","","","","","","","","","","","","","","","","","","","","","","","","","","","","","","","","","","","","","","","","","","","",""]
[null,null,null,null,null,null,null,null,null,null,null,null,null,null,null,null,null,null,null,null,null,null,null,null,null,null,null,null,"","","",0,0,"","",null,"","","","","","","","","","","","","","","","","","","","","","","","","","","","","","","","","","","","","","","","","","","","","","","","","","","","","","","","","","","","","","","","","","","","","","","","","","","","","","","","","","","","","","","","","","","","","","","","","","","","","","","","","","","","","","","","","","","","","","","","","","","","","","","","","","","","","","","","","","","","","","","","","","","","","",""]
[null,null,null,null,null,null,null,null,null,null,null,null,null,null,null,null,null,null,null,null,null,null,null,null,null,null,null,null,"","","",0,0,"","",null,"","","","","","","","","","","","","","","","","","","","","","","","","","","","","","","","","","","","","","","","","","","","","","","","","","","","","","","","","","","","","","","","","","","","","","","","","","","","","","","","","","","","","","","","","","","","","","","","","","","","","","","","","","","","","","","","","","","","","","","","","","","","","","","","","","","","","","","","","","","","","","","","","","","","","",""]
[null,null,null,null,null,null,null,null,null,null,null,null,null,null,null,null,null,null,null,null,null,null,null,null,null,null,null,null,"","","",0,0,"","",null,"","","","","","","","","","","","","","","","","","","","","","","","","","","","","","","","","","","","","","","","","","","","","","","","","","","","","","","","","","","","","","","","","","","","","","","","","","","","","","","","","","","","","","","","","","","","","","","","","","","","","","","","","","","","","","","","","","","","","","","","","","","","","","","","","","","","","","","","","","","","","","","","","","","","","",""]
[null,null,null,null,null,null,null,null,null,null,null,null,null,null,null,null,null,null,null,null,null,null,null,null,null,null,null,null,"","","",0,0,"","",null,"","","","","","","","","","","","","","","","","","","","","","","","","","","","","","","","","","","","","","","","","","","","","","","","","","","","","","","","","","","","","","","","","","","","","","","","","","","","","","","","","","","","","","","","","","","","","","","","","","","","","","","","","","","","","","","","","","","","","","","","","","","","","","","","","","","","","","","","","","","","","","","","","","","","","",""]
[null,null,null,null,null,null,null,null,null,null,null,null,null,null,null,null,null,null,null,null,null,null,null,null,null,null,null,null,"","","",0,0,"","",null,"","","","","","","","","","","","","","","","","","","","","","","","","","","","","","","","","","","","","","","","","","","","","","","","","","","","","","","","","","","","","","","","","","","","","","","","","","","","","","","","","","","","","","","","","","","","","","","","","","","","","","","","","","","","","","","","","","","","","","","","","","","","","","","","","","","","","","","","","","","","","","","","","","","","","",""]
[null,null,null,null,null,null,null,null,null,null,null,null,null,null,null,null,null,null,null,null,null,null,null,null,null,null,null,null,"","","",0,0,"","",null,"","","","","","","","","","","","","","","","","","","","","","","","","","","","","","","","","","","","","","","","","","","","","","","","","","","","","","","","","","","","","","","","","","","","","","","","","","","","","","","","","","","","","","","","","","","","","","","","","","","","","","","","","","","","","","","","","","","","","","","","","","","","","","","","","","","","","","","","","","","","","","","","","","","","","",""]
[null,null,null,null,null,null,null,null,null,null,null,null,null,null,null,null,null,null,null,null,null,null,null,null,null,null,null,null,"","","",0,0,"","",null,"","","","","","","","","","","","","","","","","","","","","","","","","","","","","","","","","","","","","","","","","","","","","","","","","","","","","","","","","","","","","","","","","","","","","","","","","","","","","","","","","","","","","","","","","","","","","","","","","","","","","","","","","","","","","","","","","","","","","","","","","","","","","","","","","","","","","","","","","","","","","","","","","","","","","",""]
[null,null,null,null,null,null,null,null,null,null,null,null,null,null,null,null,null,null,null,null,null,null,null,null,null,null,null,null,"","","",0,0,"","",null,"","","","","","","","","","","","","","","","","","","","","","","","","","","","","","","","","","","","","","","","","","","","","","","","","","","","","","","","","","","","","","","","","","","","","","","","","","","","","","","","","","","","","","","","","","","","","","","","","","","","","","","","","","","","","","","","","","","","","","","","","","","","","","","","","","","","","","","","","","","","","","","","","","","","","",""]
[null,null,null,null,null,null,null,null,null,null,null,null,null,null,null,null,null,null,null,null,null,null,null,null,null,null,null,null,"","","",0,0,"","",null,"","","","","","","","","","","","","","","","","","","","","","","","","","","","","","","","","","","","","","","","","","","","","","","","","","","","","","","","","","","","","","","","","","","","","","","","","","","","","","","","","","","","","","","","","","","","","","","","","","","","","","","","","","","","","","","","","","","","","","","","","","","","","","","","","","","","","","","","","","","","","","","","","","","","","",""]
[null,null,null,null,null,null,null,null,null,null,null,null,null,null,null,null,null,null,null,null,null,null,null,null,null,null,null,null,"","","",0,0,"","",null,"","","","","","","","","","","","","","","",{"$f":"IF($AD74=\"\",\"\",IF(AZ$10<=$AG74,\"Finished\",IF(AZ$10<=MIN($AE74,$AF74),\"Actual\",IF(AZ$10<=$AE74,\"BudgetLeft\",IF(AZ$10<=$AF74,\"BudgetOver\",\"\")))))","v":""},"","","","","","","","","","","","","","","",{"$f":"IF($AD74=\"\",\"\",IF(BP$10<=$AG74,\"Finished\",IF(BP$10<=MIN($AE74,$AF74),\"Actual\",IF(BP$10<=$AE74,\"BudgetLeft\",IF(BP$10<=$AF74,\"BudgetOver\",\"\")))))","v":""},"","","","","","","","","","","","","","","","","","","","","","","","","","","","","","",{"$f":"IF($AD74=\"\",\"\",IF(CU$10<=$AG74,\"Finished\",IF(CU$10<=MIN($AE74,$AF74),\"Actual\",IF(CU$10<=$AE74,\"BudgetLeft\",IF(CU$10<=$AF74,\"BudgetOver\",\"\")))))","v":""},"","","","","","","","","","","","","","","","","","","","","","","","","","","","","","","","","","","","","","","","","","","",{"$f":"IF($AD74=\"\",\"\",IF(EM$10<=$AG74,\"Finished\",IF(EM$10<=MIN($AE74,$AF74),\"Actual\",IF(EM$10<=$AE74,\"BudgetLeft\",IF(EM$10<=$AF74,\"BudgetOver\",\"\")))))","v":""},"","","","","","","","","","","","","","","",{"$f":"IF($AD74=\"\",\"\",IF(FC$10<=$AG74,\"Finished\",IF(FC$10<=MIN($AE74,$AF74),\"Actual\",IF(FC$10<=$AE74,\"BudgetLeft\",IF(FC$10<=$AF74,\"BudgetOver\",\"\")))))","v":""},"","","","","","","","","","","","","","","","","","","","","","","","","","",""]
[null,null,null,null,null,null,null,null,null,null,null,null,null,null,null,null,null,null,null,null,null,null,null,null,null,null,null,null,"",{"$f":"IFERROR(IF(AE75=\"\",\"\",INDEX($AA$10:$AC$207,MATCH(AE75,$AC$10:$AC$199,0),1)),\"\")","v":""},"",0,0,"","",null,{"$f":"IF($AD75=\"\",\"\",IF(AK$10<=$AG75,\"Finished\",IF(AK$10<=MIN($AE75,$AF75),\"Actual\",IF(AK$10<=$AE75,\"BudgetLeft\",IF(AK$10<=$AF75,\"BudgetOver\",\"\")))))","v":""},"","","","","","","","","","","","","","","","","","","","","","","","","","","","","","","","","","","","","","","","","","","","","","",{"$f":"IF($AD75=\"\",\"\",IF(CF$10<=$AG75,\"Finished\",IF(CF$10<=MIN($AE75,$AF75),\"Actual\",IF(CF$10<=$AE75,\"BudgetLeft\",IF(CF$10<=$AF75,\"BudgetOver\",\"\")))))","v":""},"","","","","","","","","","","","","","","","","","","","","","","","","","","","","","",{"$f":"IF($AD75=\"\",\"\",IF(DK$10<=$AG75,\"Finished\",IF(DK$10<=MIN($AE75,$AF75),\"Actual\",IF(DK$10<=$AE75,\"BudgetLeft\",IF(DK$10<=$AF75,\"BudgetOver\",\"\")))))","v":""},"","","","","","","","","","","","","","","",{"$f":"IF($AD75=\"\",\"\",IF(EA$10<=$AG75,\"Finished\",IF(EA$10<=MIN($AE75,$AF75),\"Actual\",IF(EA$10<=$AE75,\"BudgetLeft\",IF(EA$10<=$AF75,\"BudgetOver\",\"\")))))","v":""},"","","","","","","","","","","","","","","","","","","","","","","","","","","","","","","","","","","","","","","","","",{"$f":"IF($AD75=\"\",\"\",IF(FQ$10<=$AG75,\"Finished\",IF(FQ$10<=MIN($AE75,$AF75),\"Actual\",IF(FQ$10<=$AE75,\"BudgetLeft\",IF(FQ$10<=$AF75,\"BudgetOver\",\"\")))))","v":""},"","","","","","","","","","","","",""]
[null,null,null,null,null,null,null,null,null,null,null,null,null,null,null,null,null,null,null,null,null,null,null,null,null,null,null,null,{"$f":"IF(OR(AA76=\"\",COUNTIFS($AB$11:$AB$38,AA76)=1),\"\",SUMIFS($G$11:$G$600,$B$11:$B$600,AA76)+ROW(AA76)*0.0001)","v":""},"",{"$f":"IFERROR(LARGE($AC$11:$AC$207,ROW(AC76)-10),\"\")","v":""},{"$f":"IFERROR(SUMIFS($H$11:$H$599,$B$11:$B$599,AD76),\"\")","v":0},{"$f":"IFERROR(SUMIFS($G$11:$G$599,$B$11:$B$599,AD76,$C$11:$C$599,\"6_Implemented\")+SUMIFS($G$11:$G$599,$B$11:$B$599,AD76,$C$11:$C$599,\"5_Readay\"),\"\")","v":0},{"$f":"IFERROR(MAX(AE76-AF76,0),\"\")","v":""},{"$f":"IFERROR(MAX(AF76-AE76,0),\"\")","v":""},null,"","","","","","","","","","","","","","","","","","","","","","","","","","","","","","","","","","","","","","","","","","","","","","","","","","","","","","","","","","","","","","","","","","","","","","","","","","","","","","","","","","","","","","","","","","","","","","","","","","","","","","","","","","","","","","","","","","","","","","","","","","","","","","","","","","","","","","","","","","","","","","","","","","","","","",""]
[null,null,null,null,null,null,null,null,null,null,null,null,null,null,null,null,null,null,null,null,null,null,null,null,null,null,null,null,"","","",0,0,"","",null,"","","","","","","","","","","","","","","","","","","","","","","","","","","","","","","","","","","","","","","","","","","","","","","","","","","","","","","","","","","","","","","","","","","","","","","","","","","","","","","","","","","","","","","","","","","","","","","","","","","","","","","","","","","","","","","","","","","","","","","","","","","","","","","","","","","","","","","","","","","","","","","","","","","","","",""]
[null,null,null,null,null,null,null,null,null,null,null,null,null,null,null,null,null,null,null,null,null,null,null,null,null,null,null,null,"","","",0,0,"","",null,"","","","","","","","","","","","","","","","","","","","","","","","","","","","","","","","","","","","","","","","","","","","","","","","","","","","","","","","","","","","","","","","","","","","","","","","","","","","","","","","","","","","","","","","","","","","","","","","","","","","","","","","","","","","","","","","","","","","","","","","","","","","","","","","","","","","","","","","","","","","","","","","","","","","","",""]
[null,null,null,null,null,null,null,null,null,null,null,null,null,null,null,null,null,null,null,null,null,null,null,null,null,null,null,null,"","","",0,0,"","",null,"","","","","","","","","","","","","","","","","","","","","","","","","","","","","","","","","","","","","","","","","","","","","","","","","","","","","","","","","","","","","","","","","","","","","","","","","","","","","","","","","","","","","","","","","","","","","","","","","","","","","","","","","","","","","","","","","","","","","","","","","","","","","","","","","","","","","","","","","","","","","","","","","","","","","",""]
[null,null,null,null,null,null,null,null,null,null,null,null,null,null,null,null,null,null,null,null,null,null,null,null,null,null,null,null,"","","",0,0,"","",null,"","","","","","","","","","","","","","","","","","","","","","","","","","","","","","","","","","","","","","","","","","","","","","","","","","","","","","","","","","","","","","","","","","","","","","","","","","","","","","","","","","","","","","","","","","","","","","","","","","","","","","","","","","","","","","","","","","","","","","","","","","","","","","","","","","","","","","","","","","","","","","","","","","","","","",""]
[null,null,null,null,null,null,null,null,null,null,null,null,null,null,null,null,null,null,null,null,null,null,null,null,null,null,null,null,"","","",0,0,"","",null,"","","","","","","","","","","","","","","","","","","","","","","","","","","","","","","","","","","","","","","","","","","","","","","","","","","","","","","","","","","","","","","","","","","","","","","","","","","","","","","","","","","","","","","","","","","","","","","","","","","","","","","","","","","","","","","","","","","","","","","","","","","","","","","","","","","","","","","","","","","","","","","","","","","","","",""]
[null,null,null,null,null,null,null,null,null,null,null,null,null,null,null,null,null,null,null,null,null,null,null,null,null,null,null,null,"","","",0,0,"","",null,"","","","","","","","","","","","","","","","","","","","","","","","","","","","","","","","","","","","","","","","","","","","","","","","","","","","","","","","","","","","","","","","","","","","","","","","","","","","","","","","","","","","","","","","","","","","","","","","","","","","","","","","","","","","","","","","","","","","","","","","","","","","","","","","","","","","","","","","","","","","","","","","","","","","","",""]
[null,null,null,null,null,null,null,null,null,null,null,null,null,null,null,null,null,null,null,null,null,null,null,null,null,null,null,null,"","","",0,0,"","",null,"","","","","","","","","","","","","","","","","","","","","","","","","","","","","","","","","","","","","","","","","","","","","","","","","","","","","","","","","","","","","","","","","","","","","","","","","","","","","","","","","","","","","","","","","","","","","","","","","","","","","","","","","","","","","","","","","","","","","","","","","","","","","","","","","","","","","","","","","","","","","","","","","","","","","",""]
[null,null,null,null,null,null,null,null,null,null,null,null,null,null,null,null,null,null,null,null,null,null,null,null,null,null,null,null,"","","",0,0,"","",null,"","","","","","","","","","","","","","","","","","","","","","","","","","","","","","","","","","","","","","","","","","","","","","","","","","","","","","","","","","","","","","","","","","","","","","","","","","","","","","","","","","","","","","","","","","","","","","","","","","","","","","","","","","","","","","","","","","","","","","","","","","","","","","","","","","","","","","","","","","","","","","","","","","","","","",""]
[null,null,null,null,null,null,null,null,null,null,null,null,null,null,null,null,null,null,null,null,null,null,null,null,null,null,null,null,"","","",0,0,"","",null,"","","","","","","","","","","","","","","","","","","","","","","","","","","","","","","","","","","","","","","","","","","","","","","","","","","","","","","","","","","","","","","","","","","","","","","","","","","","","","","","","","","","","","","","","","","","","","","","","","","","","","","","","","","","","","","","","","","","","","","","","","","","","","","","","","","","","","","","","","","","","","","","","","","","","",""]
[null,null,null,null,null,null,null,null,null,null,null,null,null,null,null,null,null,null,null,null,null,null,null,null,null,null,null,null,"","","",0,0,"","",null,"","","","","","","","","","","","","","","","","","","","","","","","","","","","","","","","","","","","","","","","","","","","","","","","","","","","","","","","","","","","","","","","","","","","","","","","","","","","","","","","","","","","","","","","","","","","","","","","","","","","","","","","","","","","","","","","","","","","","","","","","","","","","","","","","","","","","","","","","","","","","","","","","","","","","",""]
[null,null,null,null,null,null,null,null,null,null,null,null,null,null,null,null,null,null,null,null,null,null,null,null,null,null,null,null,"","","",0,0,"","",null,"","","","","","","","","","","","","","","","","","","","","","","","","","","","","","","","","","","","","","","","","","","","","","","","","","","","","","","","","","","","","","","","","","","","","","","","","","","","","","","","","","","","","","","","","","","","","","","","","","","","","","","","","","","","","","","","","","","","","","","","","","","","","","","","","","","","","","","","","","","","","","","","","","","","","",""]
[null,null,null,null,null,null,null,null,null,null,null,null,null,null,null,null,null,null,null,null,null,null,null,null,null,null,null,null,"","","",0,0,"","",null,"","","","","","","","","","","","","","","","","","","","","","","","","","","","","","","","","","","","","","","","","","","","","","","","","","","","","","","","","","","","","","","","","","","","","","","","","","","","","","","","","","","","","","","","","","","","","","","","","","","","","","","","","","","","","","","","","","","","","","","","","","","","","","","","","","","","","","","","","","","","","","","","","","","","","",""]
[null,null,null,null,null,null,null,null,null,null,null,null,null,null,null,null,null,null,null,null,null,null,null,null,null,null,null,null,"","","",0,0,"","",null,"","","","","","","","","","","","","","","","","","","","","","","","","","","","","","","","","","","","","","","","","","","","","","",{"$f":"IF($AD89=\"\",\"\",IF(CE$10<=$AG89,\"Finished\",IF(CE$10<=MIN($AE89,$AF89),\"Actual\",IF(CE$10<=$AE89,\"BudgetLeft\",IF(CE$10<=$AF89,\"BudgetOver\",\"\")))))","v":""},"","","","","","","","","","","","","","","","","","","","","","","","","","","","","","","","","","","","","","","","","","","","","","","","","","","","","","","","","","","","","","","","","","","","","","","","","","","","","","","","","","","","","","","","","","","","","","","","","","","","","","",""]
[null,null,null,null,null,null,null,null,null,null,null,null,null,null,null,null,null,null,null,null,null,null,null,null,null,null,null,null,"","","",0,0,"","",null,"","","","","","","","","","","","","","","",{"$f":"IF($AD90=\"\",\"\",IF(AZ$10<=$AG90,\"Finished\",IF(AZ$10<=MIN($AE90,$AF90),\"Actual\",IF(AZ$10<=$AE90,\"BudgetLeft\",IF(AZ$10<=$AF90,\"BudgetOver\",\"\")))))","v":""},"","","","","","","","","","","","","","","",{"$f":"IF($AD90=\"\",\"\",IF(BP$10<=$AG90,\"Finished\",IF(BP$10<=MIN($AE90,$AF90),\"Actual\",IF(BP$10<=$AE90,\"BudgetLeft\",IF(BP$10<=$AF90,\"BudgetOver\",\"\")))))","v":""},"","","","","","","","","","","","","","","","","","","","","","","","","","","","","","","",{"$f":"IF($AD90=\"\",\"\",IF(CV$10<=$AG90,\"Finished\",IF(CV$10<=MIN($AE90,$AF90),\"Actual\",IF(CV$10<=$AE90,\"BudgetLeft\",IF(CV$10<=$AF90,\"BudgetOver\",\"\")))))","v":""},"","","","","","","","","","","","","","","","","","","","","","","","","","","","","","","","","","","","","","","","","","","","","",{"$f":"IF($AD90=\"\",\"\",IF(EP$10<=$AG90,\"Finished\",IF(EP$10<=MIN($AE90,$AF90),\"Actual\",IF(EP$10<=$AE90,\"BudgetLeft\",IF(EP$10<=$AF90,\"BudgetOver\",\"\")))))","v":""},"","","","","","","","","","","","","","","",{"$f":"IF($AD90=\"\",\"\",IF(FF$10<=$AG90,\"Finished\",IF(FF$10<=MIN($AE90,$AF90),\"Actual\",IF(FF$10<=$AE90,\"BudgetLeft\",IF(FF$10<=$AF90,\"BudgetOver\",\"\")))))","v":""},"","","","","","","","","","","","","","","","","","","","","","","",""]
[null,null,null,null,null,null,null,null,null,null,null,null,null,null,null,null,null,null,null,null,null,null,null,null,null,null,null,null,"","","",0,0,"","",null,{"$f":"IF($AD91=\"\",\"\",IF(AK$10<=$AG91,\"Finished\",IF(AK$10<=MIN($AE91,$AF91),\"Actual\",IF(AK$10<=$AE91,\"BudgetLeft\",IF(AK$10<=$AF91,\"BudgetOver\",\"\")))))","v":""},"","","","","","","","","","","","","","","","","","","","","","","","","","","","","","","","","","","","","","","","","","","","","","","","","","","","","","","",{"$f":"IF($AD91=\"\",\"\",IF(CO$10<=$AG91,\"Finished\",IF(CO$10<=MIN($AE91,$AF91),\"Actual\",IF(CO$10<=$AE91,\"BudgetLeft\",IF(CO$10<=$AF91,\"BudgetOver\",\"\")))))","v":""},"","","","","","","","","","","","","","","","","","","","","","",{"$f":"IF($AD91=\"\",\"\",IF(DL$10<=$AG91,\"Finished\",IF(DL$10<=MIN($AE91,$AF91),\"Actual\",IF(DL$10<=$AE91,\"BudgetLeft\",IF(DL$10<=$AF91,\"BudgetOver\",\"\")))))","v":""},"","","","","","","","","","","","","","","",{"$f":"IF($AD91=\"\",\"\",IF(EB$10<=$AG91,\"Finished\",IF(EB$10<=MIN($AE91,$AF91),\"Actual\",IF(EB$10<=$AE91,\"BudgetLeft\",IF(EB$10<=$AF91,\"BudgetOver\",\"\")))))","v":""},"","","","","","","","","","","","","","","","","","","","","","","","","","","","","","","","","","","","","","","","","","","","","",{"$f":"IF($AD91=\"\",\"\",IF(FV$10<=$AG91,\"Finished\",IF(FV$10<=MIN($AE91,$AF91),\"Actual\",IF(FV$10<=$AE91,\"BudgetLeft\",IF(FV$10<=$AF91,\"BudgetOver\",\"\")))))","v":""},"","","","","","","",""]
[null,null,null,null,null,null,null,null,null,null,null,null,null,null,null,null,null,null,null,null,null,null,null,null,null,null,null,null,"","","",0,0,"","",null,"","","","","","","","","","","","","","","","","","","","","","","","","","","","","","","","","","","","","","","","","","","","","","","","","","","","","","","","","","","","","","","","","","","","","","","","","","","","","","","","","","","","","","","","","","","","","","","","","","","","","","","","","","","","","","","","","","","","","","","","","","","","","","","","","","","","","","","","","","","","","","","","","","","","","",""]
[null,null,null,null,null,null,null,null,null,null,null,null,null,null,null,null,null,null,null,null,null,null,null,null,null,null,null,null,"","","",0,0,"","",null,"","","","","","","","","","","","","","","","","","","","","","","","","","","","","","","","","","","","","","","","","","","","","","","","","","","","","","","","","","","","","","","","","","","","","","","","","","","","","","","","","","","","","","","","","","","","","","","","","","","","","","","","","","","","","","","","","","","","","","","","","","","","","","","","","","","","","","","","","","","","","","","","","","","","","",""]
[null,null,null,null,null,null,null,null,null,null,null,null,null,null,null,null,null,null,null,null,null,null,null,null,null,null,null,null,"","","",0,0,"","",null,"","","","","","","","","","","","","","","","","","","","","","","","","","","","","","","","","","","","","","","","","","","","","","","","","","","","","","","","","","","","","","","","","","","","","","","","","","","","","","","","","","","","","","","","","","","","","","","","","","","","","","","","","","","","","","","","","","","","","","","","","","","","","","","","","","","","","","","","","","","","","","","","","","","","","",""]
[null,null,null,null,null,null,null,null,null,null,null,null,null,null,null,null,null,null,null,null,null,null,null,null,null,null,null,null,"","","",0,0,"","",null,"","","","","","","","","","","","","","","","","","","","","","","","","","","","","","","","","","","","","","","","","","","","","","","","","","","","","","","","","","","","","","","","","","","","","","","","","","","","","","","","","","","","","","","","","","","","","","","","","","","","","","","","","","","","","","","","","","","","","","","","","","","","","","","","","","","","","","","","","","","","","","","","","","","","","",""]
[null,null,null,null,null,null,null,null,null,null,null,null,null,null,null,null,null,null,null,null,null,null,null,null,null,null,null,null,"","","",0,0,"","",null,"","","","","","","","","","","","","","","","","","","","","","","","","","","","","","","","","","","","","","","","","","","","","","","","","","","","","","","","","","","","","","","","","","","","","","","","","","","","","","","","","","","","","","","","","","","","","","","","","","","","","","","","","","","","","","","","","","","","","","","","","","","","","","","","","","","","","","","","","","","","","","","","","","","","","",""]
[null,null,null,null,null,null,null,null,null,null,null,null,null,null,null,null,null,null,null,null,null,null,null,null,null,null,null,null,"","","",0,0,"","",null,"","","","","","","","","","","","","","","","","","","","","","","","","","","","","","","","","","","","","","","","","","","","","","","","","","","","","","","","","","","","","","","","","","","","","","","","","","","","","","","","","","","","","","","","","","","","","","","","","","","","","","","","","","","","","","","","","","","","","","","","","","","","","","","","","","","","","","","","","","","","","","","","","","","","","",""]
[null,null,null,null,null,null,null,null,null,null,null,null,null,null,null,null,null,null,null,null,null,null,null,null,null,null,null,null,"","","",0,0,"","",null,"","","","","","","","","","","","","","","","","","","","","","","","","","","","","","","","","","","","","","","","","","","","","","","","","","","","","","","","","","","","","","","","","","","","","","","","","","","","","","","","","","","","","","","","","","","","","","","","","","","","","","","","","","","","","","","","","","","","","","","","","","","","","","","","","","","","","","","","","","","","","","","","","","","","","",""]
[null,null,null,null,null,null,null,null,null,null,null,null,null,null,null,null,null,null,null,null,null,null,null,null,null,null,null,null,"","","",0,0,"","",null,"","","","","","","","","","","","","","","","","","","","","","","","","","","","","","","","","","","","","","","","","","","","","","","","","","","","","","","","","","","","","","","","","","","","","","","","","","","","","","","","","","","","","","","","","","","","","","","","","","","","","","","","","","","","","","","","","","","","","","","","","","","","","","","","","","","","","","","","","","","","","","","","","","","","","",""]
[null,null,null,null,null,null,null,null,null,null,null,null,null,null,null,null,null,null,null,null,null,null,null,null,null,null,null,null,"","","",0,0,"","",null,"","","","","","","","","","","","","","","","","","","","","","","","","","","","","","","","","","","","","","","","","","","","","","","","","","","","","","","","","","","","","","","","","","","","","","","","","","","","","","","","","","","","","","","","","","","","","","","","","","","","","","","","","","","","","","","","","","","","","","","","","","","","","","","","","","","","","","","","","","","","","","","","","","","","","",""]
[null,null,null,null,null,null,null,null,null,null,null,null,null,null,null,null,null,null,null,null,null,null,null,null,null,null,null,null,"","","",0,0,"","",null,"","","","","","","","","","","","","","","","","","","","","","","","","","","","","","","","","","","","","","","","","","","","","","","","","","","","","","","","","","","","","","","","","","","","","","","","","","","","","","","","","","","","","","","","","","","","","","","","","","","","","","","","","","","","","","","","","","","","","","","","","","","","","","","","","","","","","","","","","","","","","","","","","","","","","",""]
[null,null,null,null,null,null,null,null,null,null,null,null,null,null,null,null,null,null,null,null,null,null,null,null,null,null,null,null,"","","",0,0,"","",null,"","","","","","","","","","","","","","","","","","","","","","","","","","","","","","","","","","","","","","","","","","","","","","","","","","","","","","","","","","","","","","","","","","","","","","","","","","","","","","","","","","","","","","","","","","","","","","","","","","","","","","","","","","","","","","","","","","","","","","","","","","","","","","","","","","","","","","","","","","","","","","","","","","","","","",""]
[null,null,null,null,null,null,null,null,null,null,null,null,null,null,null,null,null,null,null,null,null,null,null,null,null,null,null,null,"","","",0,0,"","",null,"","","","","","","","","","","","","","","","","","","","","","","","","","","","","","","","","","","","","","","","","","","","","","","","","","","","","","","","","","","","","","","","","","","","","","","","","","","","","","","","","","","","","","","","","","","","","","","","","","","","","","","","","","","","","","","","","","","","","","","","","","","","","","","","","","","","","","","","","","","","","","","","","","","","","",""]
[null,null,null,null,null,null,null,null,null,null,null,null,null,null,null,null,null,null,null,null,null,null,null,null,null,null,null,null,"","","",0,0,"","",null,"","","","","","","","","","","","","","","","","","","","","","","","","","","","","","","","","","","","","","","","","","","","","","","","","","","","","","","","","","","","","","","","","","","","","","","","","","","","","","","","","","","","","","","","","","","","","","","","","","","","","","","","","","","","","","","","","","","","","","","","","","","","","","","","","","","","","","","","","","","","","","","","","","","","","",""]
[null,null,null,null,null,null,null,null,null,null,null,null,null,null,null,null,null,null,null,null,null,null,null,null,null,null,null,null,"","","",0,0,"","",null,"","","","","","","","","","","","","","","","","","","","","","","","","","","","","","","","","","","","","","","","","","","","","","",{"$f":"IF($AD105=\"\",\"\",IF(CE$10<=$AG105,\"Finished\",IF(CE$10<=MIN($AE105,$AF105),\"Actual\",IF(CE$10<=$AE105,\"BudgetLeft\",IF(CE$10<=$AF105,\"BudgetOver\",\"\")))))","v":""},"","","","","","","","","","","","","","","","","","","","","","","","","","","","","","","","","","","","","","","","","","","","","","","","","","","","","","","","","","","","","","","","","","","","","","","","","","","","","","","","","","","","","","","","","","","","","","","","","","","","","","",""]
[null,null,null,null,null,null,null,null,null,null,null,null,null,null,null,null,null,null,null,null,null,null,null,null,null,null,null,null,"","","",0,0,"","",null,"","","","","","","","","","","","","","","",{"$f":"IF($AD106=\"\",\"\",IF(AZ$10<=$AG106,\"Finished\",IF(AZ$10<=MIN($AE106,$AF106),\"Actual\",IF(AZ$10<=$AE106,\"BudgetLeft\",IF(AZ$10<=$AF106,\"BudgetOver\",\"\")))))","v":""},"","","","","","","","","","","","","","","",{"$f":"IF($AD106=\"\",\"\",IF(BP$10<=$AG106,\"Finished\",IF(BP$10<=MIN($AE106,$AF106),\"Actual\",IF(BP$10<=$AE106,\"BudgetLeft\",IF(BP$10<=$AF106,\"BudgetOver\",\"\")))))","v":""},"","","","","","","","","","","","","","","","","","","","","","","","","","","","","","","","","","","","","","","","",{"$f":"IF($AD106=\"\",\"\",IF(DE$10<=$AG106,\"Finished\",IF(DE$10<=MIN($AE106,$AF106),\"Actual\",IF(DE$10<=$AE106,\"BudgetLeft\",IF(DE$10<=$AF106,\"BudgetOver\",\"\")))))","v":""},"","","","","","","","","","","","","","","","","","","","","","","","","","","","","","","","","","","","","","",{"$f":"IF($AD106=\"\",\"\",IF(ER$10<=$AG106,\"Finished\",IF(ER$10<=MIN($AE106,$AF106),\"Actual\",IF(ER$10<=$AE106,\"BudgetLeft\",IF(ER$10<=$AF106,\"BudgetOver\",\"\")))))","v":""},"","","","","","","","","","","","","","","",{"$f":"IF($AD106=\"\",\"\",IF(FH$10<=$AG106,\"Finished\",IF(FH$10<=MIN($AE106,$AF106),\"Actual\",IF(FH$10<=$AE106,\"BudgetLeft\",IF(FH$10<=$AF106,\"BudgetOver\",\"\")))))","v":""},"","","","","","","","","","","","","","","","","","","","","",""]
[null,null,null,null,null,null,null,null,null,null,null,null,null,null,null,null,null,null,null,null,null,null,null,null,null,null,null,null,"","","",0,0,"","",null,{"$f":"IF($AD107=\"\",\"\",IF(AK$10<=$AG107,\"Finished\",IF(AK$10<=MIN($AE107,$AF107),\"Actual\",IF(AK$10<=$AE107,\"BudgetLeft\",IF(AK$10<=$AF107,\"BudgetOver\",\"\")))))","v":""},"","","","","","","","","","","","","","","","","","","","","","","","","","","","","","","","","","","","","","","","","","","","","","","","","","","","","","","","","","","","","",{"$f":"IF($AD107=\"\",\"\",IF(CU$10<=$AG107,\"Finished\",IF(CU$10<=MIN($AE107,$AF107),\"Actual\",IF(CU$10<=$AE107,\"BudgetLeft\",IF(CU$10<=$AF107,\"BudgetOver\",\"\")))))","v":""},"","","","","","","","","","","","","","","","","","","","","","","",{"$f":"IF($AD107=\"\",\"\",IF(DS$10<=$AG107,\"Finished\",IF(DS$10<=MIN($AE107,$AF107),\"Actual\",IF(DS$10<=$AE107,\"BudgetLeft\",IF(DS$10<=$AF107,\"BudgetOver\",\"\")))))","v":""},"","","","","","","","","","","","","","","",{"$f":"IF($AD107=\"\",\"\",IF(EI$10<=$AG107,\"Finished\",IF(EI$10<=MIN($AE107,$AF107),\"Actual\",IF(EI$10<=$AE107,\"BudgetLeft\",IF(EI$10<=$AF107,\"BudgetOver\",\"\")))))","v":""},"","","","","","","","","","","","","","","","","","","","","","","","","","","","","","","","","","","","","","","","",{"$f":"IF($AD107=\"\",\"\",IF(FX$10<=$AG107,\"Finished\",IF(FX$10<=MIN($AE107,$AF107),\"Actual\",IF(FX$10<=$AE107,\"BudgetLeft\",IF(FX$10<=$AF107,\"BudgetOver\",\"\")))))","v":""},"","","","","",""]
[null,null,null,null,null,null,null,null,null,null,null,null,null,null,null,null,null,null,null,null,null,null,null,null,null,null,null,null,"","","",0,0,"","",null,"","","","","","","","","","","","","","","","","","","","","","","","","","","","","","","","","","","","","","","","","","","","","","","","","","","","","","","","","","","","","","","","","","","","","","","","","","","","","","","","","","","","","","","","","","","","","","","","","","","","","","","","","","","","","","","","","","","","","","","","","","","","","","","","","","","","","","","","","","","","","","","","","","","","","",""]
[null,null,null,null,null,null,null,null,null,null,null,null,null,null,null,null,null,null,null,null,null,null,null,null,null,null,null,null,"","","",0,0,"","",null,"","","","","","","","","","","","","","","","","","","","","","","","","","","","","","","","","","","","","","","","","","","","","","","","","","","","","","","","","","","","","","","","","","","","","","","","","","","","","","","","","","","","","","","","","","","","","","","","","","","","","","","","","","","","","","","","","","","","","","","","","","","","","","","","","","","","","","","","","","","","","","","","","","","","","",""]

{"sheet":"DB","index":6,"n_rows":10,"n_cols":26,"rows_kept":10,"cut":false,"hidden":true,"merged":[]}
[]
[]
[]
[]
[]
[]
[]
[]
[]
["_Key","_ProjectType","X1","_ProjectPrio","_DescShort","Placeholder","FolderFile","_SheetName","_Project","_SubProject","_Task","_Staff","_Status","_Hours","_StartDate","_EndDate","_Description","_MainCategory","_Category","_SubCategory","_Comment","_ProjectAndSubProject","_PlannedDate","_Priority","_HourBalance","_TotalHoursPerDay"]

{"sheet":"ClientMaster","index":7,"n_rows":41,"n_cols":12,"rows_kept":41,"cut":false,"hidden":true,"merged":[]}
["_Project","_SubProject",null,"_Project",null,"_ProjectType","(All)",null,null,"_ProjectType","(All)"]
["(blank)","(blank)",null,"(blank)"]
["Internt","XLD_Internal",null,"Internt",null,"_Project","_SubProject","Sum of _hours",null,"_Project","_SubProject","Sum of _Hours"]
["Internt","MeetingAboutClientProject",null,"ProjectA",null,"(blank)","(blank)",null,null,"(blank)","(blank)"]
["Internt","Internal",null,"ProjectB",null,"Internt","XLD_Internal",4.4000000000000004,null,"Internt","XLD_Internal",4.4000000000000004]
["Internt","Email Importer",null,"XLD_Internal",null,"Internt","MeetingAboutClientProject",0.4,null,"Internt","MeetingAboutClientProject",0.4]
["ProjectA","Basic model 2306",null,"StaffPlanning",null,"Internt","Internal",1.5302777767367659,null,"Internt","Internal",1.5302777767367659]
["ProjectA","230615_OffertMall",null,"ProjectC",null,"Internt","Email Importer",1.5,null,"Internt","Email Importer",1.5]
["ProjectA","Updates2303",null,"ProjektA",null,"ProjectA","Basic model 2306",3.5,null,"ProjectA","Basic model 2306",3.5]
["ProjectA","PrototypeA",null,"ProjektB",null,"ProjectA","230615_OffertMall",1,null,"ProjectA","230615_OffertMall",1]
["ProjectA","UpgradesA",null,null,null,"ProjectA","Updates2303",1.6747222199337557,null,"ProjectA","Updates2303",1.6747222199337557]
["ProjectB","XLD_Internal",null,null,null,"ProjectA","PrototypeA",2.5,null,"ProjectA","PrototypeA",2.5]
["ProjectB","Updates2303Suggestion",null,null,null,"ProjectA","UpgradesA",2.5,null,"ProjectA","UpgradesA",2.5]
["ProjectB","230425_XX",null,null,null,"ProjectB","XLD_Internal",1.9,null,"ProjectB","XLD_Internal",1.9]
["ProjectB","MonthlyBudget",null,null,null,"ProjectB","Updates2303Suggestion",2,null,"ProjectB","Updates2303Suggestion",2]
["ProjectB","QuarterlBudget",null,null,null,"ProjectB","230425_XX",1,null,"ProjectB","230425_XX",1]
["ProjectB","HandOverFile",null,null,null,"ProjectB","MonthlyBudget",2,null,"ProjectB","MonthlyBudget",2]
["ProjectB","CSV Import",null,null,null,"ProjectB","QuarterlBudget",2.7,null,"ProjectB","QuarterlBudget",2.7]
["ProjectB","Support2303",null,null,null,"ProjectB","HandOverFile",0.5,null,"ProjectB","HandOverFile",0.5]
["ProjectB","Premium_Not_Zero",null,null,null,"ProjectB","CSV Import",0.8,null,"ProjectB","CSV Import",0.8]
["ProjectB","Support",null,null,null,"ProjectB","Support2303",1.2,null,"ProjectB","Support2303",1.2]
["ProjectB","UNKNOWN",null,null,null,"ProjectB","Premium_Not_Zero",1.4,null,"ProjectB","Premium_Not_Zero",1.4]
["ProjectB","Invoicing",null,null,null,"ProjectB","Support",3.3600000000000003,null,"ProjectB","Support",3.3600000000000003]
["ProjectB","Liquidity",null,null,null,"ProjectB","UNKNOWN",0.08,null,"ProjectB","UNKNOWN",0.08]
["ProjectB","PrototypeB",null,null,null,"ProjectB","Invoicing",2.5,null,"ProjectB","Invoicing",2.5]
["ProjectB","UpgradesB",null,null,null,"ProjectB","Liquidity",0.5,null,"ProjectB","Liquidity",0.5]
["XLD_Internal","XLD_Internal",null,null,null,"ProjectB","PrototypeB",150,null,"ProjectB","PrototypeB",150]
["StaffPlanning","Holiday",null,null,null,"ProjectB","UpgradesB",15,null,"ProjectB","UpgradesB",15]
["ProjectC","OfferOfImprovements",null,null,null,"XLD_Internal","XLD_Internal",2.8,null,"XLD_Internal","XLD_Internal",2.8]
["ProjectC","Support",null,null,null,"StaffPlanning","Holiday",466,null,"StaffPlanning","Holiday",466]
["ProjectC","Company_19",null,null,null,"ProjectC","OfferOfImprovements",null,null,"ProjectC","OfferOfImprovements"]
["ProjectC","Support2305",null,null,null,"ProjectC","Support",1,null,"ProjectC","Support",1]
["ProjectC","ManualHelp2305",null,null,null,"ProjectC","Company_19",1.5,null,"ProjectC","Company_19",1.5]
["ProjectC","FileNorse",null,null,null,"ProjectC","Support2305",8.3333332731854171E-2,null,"ProjectC","Support2305",8.3333332731854171E-2]
["ProjectC","Company_23",null,null,null,"ProjectC","ManualHelp2305",1.6747222223784775,null,"ProjectC","ManualHelp2305",1.6747222223784775]
["ProjektA","PrototypeA",null,null,null,"ProjectC","FileNorse",2,null,"ProjectC","FileNorse",2]
["ProjektA","UpgradesA",null,null,null,"ProjectC","Company_23",2.5,null,"ProjectC","Company_23",2.5]
["ProjektB","PrototypeB",null,null,null,"ProjektA","PrototypeA",2,null,"ProjektA","PrototypeA",2]
["ProjektB","UpgradesB",null,null,null,"ProjektA","UpgradesA",2.6,null,"ProjektA","UpgradesA",2.6]
[null,null,null,null,null,"ProjektB","PrototypeB",120,null,"ProjektB","PrototypeB",120]
[null,null,null,null,null,"ProjektB","UpgradesB",15.6,null,"ProjektB","UpgradesB",15.6]

{"sheet":"Admin","index":8,"n_rows":25,"n_cols":131,"rows_kept":25,"cut":false,"hidden":true,"merged":[]}
["RootForGeneratingPasswords","LOCKDATE",null,null,"UNLOCKED SHEETS","HIDE SHEETS","Explaination","Settings","Value",null,"ConnectedCells",null,null,null,"DatabaseLocation",null,{"$f":"COLUMN()","v":17},{"$f":"COLUMN()","v":18},null,null,null,null,null,null,null,null,null,null,null,null,null,null,"HOLIDAYS",null,"file",null,"Agents",null,"MonthToText",null,null,"DEV / PROD",null,"Status_DropDown",null,"Status_DropDown",null,"LastUpdate",null,null,null,null,"Format Update Row Hight",null,null,null,null,null,null,null,null,null,null,null,null,null,null,null,null,null,null,null,null,null,null,null,null,null,"TemplateToCopy",null,null,null,null,null,null,null,null,null,null,null,null,null,null,null,null,null,null,null,null,null,null,null,null,null,null,null,null,null,null,null,null,null,null,null,null,null,null,null,null,null,null,null,null,null,null,null,null,null,null,null,"Password"]
["zX1mHOF4BzSE","2023-10-24","DataColor","Values","wClientMaster","wDB","Looks for titles in the rows, the code will loop upwards for the TitleColor","Search Rows","Yes",null,"FromR","FromC","Column",null,null,null,"Graph Title","Color list",null,null,null,null,null,null,null,null,null,null,null,null,null,null,"2020-12-31",null,"PRODUCTION",null,null,null,1,"January",null,"DEV",null,"0_AttentionNeeded",null,"0_AttentionNeeded",null,"2023-07-17",null,null,null,null,14,null,null,null,null,null,null,null,null,null,null,null,null,null,null,null,null,null,null,null,null,null,null,null,null,null,"_Key","_Project","_SubProject","_Task","_Staff","_Status","_Hours","_StartDate","_EndDate","_Description","_MainCategory","_Category","_SubCategory","_Comment",null,null,null,null,null,null,null,null,null,null,null,null,null,null,null,null,null,null,null,null,null,null,null,null,null,null,null,null,null,null,null,null,null,null,null,null,null,null,"Serviceyeah"]
["oIP7ALgV2TbD","QRT/MNTH","_Key","Ref","wPVTsql2","wClientMaster","Looks for titles in the columns to the right, the code will loop right for the TitleColor","Search Columns","No",null,2,7,2,null,null,null,"Antal Bokningar",null,null,null,null,null,null,null,null,null,null,null,null,null,null,null,"2021-01-01",null,null,null,"LL",null,2,"February",null,null,null,null,null,null,null,null,null,null,null,null,null,null,null,null,null,null,null,null,null,null,null,null,null,null,null,null,null,null,null,null,null,null,null,null,null,null,null,{"$f":"$C$2","v":"DataColor"},null,null,null,null," "]
["PBf1K6hy2ANJ","YEAR","Title1","Marknad",null,null,"Looks for references in the columns to the right, the code will loop right for the Ref-color","Search for Ref","Yes",null,null,null,null,null,null,null,"AntalKunder",null,null,null,null,null,null,null,null,null,null,null,null,null,null,null,"2021-01-02",null,"Updated",null,"GA",null,3,"March",null,null,null,"1_Available",null,"1_Assigned",null,null,null,null,null,null,null,null,null,null,null,null,null,null,null,null,null,null,null,null,null,null,null,null,null,null,null,null,null,null,null,null,null,{"$f":"$C$2","v":"DataColor"},null,null,null,null," "]
["U22abS0FBELA","MANUAL DATE",null,null,null,null,"Writes the data to the local DB-sheet","WriteToLocalDB","Yes",null,null,null,null,null,null,null,"Produktkostnad",null,null,null,null,null,null,null,null,null,null,null,null,null,null,null,"2021-01-03",null,"Updated",null,"PG",null,4,"April",null,null,null,"2_Working",null,"2_InProgress",null,null,null,null,null,null,null,null,null,null,null,null,null,null,null,null,null,null,null,null,null,null,null,null,null,null,null,null,null,null,null,null,null,{"$f":"$C$2","v":"DataColor"},null,null,null,null," "]
["IgN18Hgg4NAT","2023-09-01",null,null,null,null,"Clear the database (but is currently not active)","ClearDataBase","No",null,null,null,null,null,null,null,"Säljkostnad",null,null,null,null,null,null,null,null,null,null,null,null,null,null,null,"2021-01-05",null,null,null,"IK",null,5,"May",null,null,null,"3_NotAvailable",null,"3_Prototype",null,null,null,null,{"$f":"INDIRECT(\"Admin!AK2:AK9\")&\"\"","v":""}]
["PXSz19ba6IVA","LOCKFORMULA",null,null,null,null,"In case a new title is found, it is added to the title-row in the database, this only works for adding to local DB-sheet","AddNewTitles","Yes",null,null,null,null,null,null,null,"Personal",null,null,null,null,null,null,null,null,null,null,null,null,null,null,null,null,null,"Uploaded",null,"EP",null,6,"June",null,null,null,"4_HolidayRequested",null,"4_Testing",null,null,null,null,"LL",null,{"$f":"INDIRECT(\"Admin!AT2:AT14\")","v":"0_AttentionNeeded"}]
["P07GgaK1bKOC",{"$f":"IF(Admin!$B$10=\"NO\",\"\",IF(Admin!$B$2=\"MONTH\",IF(MONTH(NOW())<>MONTH(Admin!$B$4),\"This is a free version. Contact Exceldepartment for unlocking full potential of the model.\",\"\"),\nIF(Admin!$B$2=\"QRT\",IF(INT((MONTH(NOW())+2)/3)<>INT((MONTH(Admin!$B$4)+2)/3),\"This is a free version. Contact Exceldepartment for unlocking full potential of the model.\",\"\"),\nIF(Admin!$B$2=\"YEAR\",IF(YEAR(NOW())<>YEAR(Admin!$B$4),\"This is a free version. Contact Exceldepartment for unlocking full potential of the model.\",\"\"),\n\"This is a free version. Contact Exceldepartment for unlocking full potential of the model.\"))))","v":"This is a free version. Contact Exceldepartment for unlocking full potential of the model."},null,null,null,null,"Defines the title row in the local DB-sheet","Titles row in DB-sheet",10,null,null,null,null,null,null,null,"Kostnad",null,null,"_Key","_SubCategory","_startDate","_endDate","_hours","_Staff","_Comment","_Category","_Description","_Status",null,null,null,null,null,"NotUploaded",null,null,null,7,"July",null,null,null,"41_HolidayApproved",null,"5_Ready",null,null,null,null,"GA",null,0]
["G90BabzCLSLO","PASSWORD",null,null,null,null,"This is used in connection with the Access/SQL-upload. It means only changes are uploaded. This is to prevent upload and overwrite changes from the schedule-file and similar.","CheckPrevious","Yes",null,null,null,null,null,null,null,"Kvantitet",null,null,null,null,null,null,null,{"$f":"$C$4","v":"Title1"},null,null,null,null,null,null,null,null,null,null,null,null,null,8,"August",null,null,null,"42_HolidayDenied",null,"6_Implemented",null,null,null,null,"PG",null,"1_Assigned"]
["JSJml83TDVIN",42,null,null,null,null,"Uloades to Access","UploadToAccess","No",null,null,null,null,null,null,null,"Ledning",null,null,null,null,null,null,null,null,null,null,null,null,null,null,null,null,null,"LeftClick",null,null,null,9,"September",null,null,null,null,null,"51_PlaceHolder",null,null,null,null,"IK",null,"2_InProgress"]
["Wr15KDosZSAN","USEPROTECTION",null,null,null,null,"Adds general data such as project-name etc.","AddGeneralData","Yes",null,null,null,null,null,null,null,"IT",null,null,null,null,null,null,null,null,null,null,null,null,null,null,null,null,null,"Dectivate",null,null,null,10,"October",null,null,null,"1_Assigned",null,"50_none",null,null,null,null,"EP",null,"3_Prototype"]
["HWilC19QXIRE","YES",null,null,null,null,"Only looks for visible cells, so if you filter cells, they will not be uploaded.","OnlyAddVisible","Yes",null,"CLASS","INPUT",null,null,null,null,"Fast kostnad",null,null,null,null,null,null,null,null,null,null,null,null,null,null,null,null,null,null,null,null,null,11,"November",null,null,null,"2_InProgress",null,"97_awaitingClient",null,null,null,null,"",null,"4_Testing"]
["ABIZG12qzMAR","USEPROTECTIONWORKBOOK",null,null,null,null,"Lets the names of the cells of the titles-colors define the names of the titles in the database. So the name of the titles in the sheet will not matter.","Titles from Admin","No",null,"SERVER",null,null,null,null,null,"Försäljning",null,null,null,null,null,null,null,null,null,null,null,null,null,null,null,null,null,"RowToMove",null,null,null,12,"December",null,null,null,"3_Prototype",null,"98_OfferSent",null,null,null,null,"",null,"5_Ready"]
["FGYhhJ0SABUB","YES",null,null,null,null,"Ussed with Titles from Admin.","Match Titles From Admin","No",null,"DATABASE",null,null,null,null,null,"Kontorskostnad",null,null,null,null,null,null,null,null,null,null,null,null,null,null,null,null,null,null,null,null,null,null,null,null,null,null,"4_Testing",null,"99_discountinued",null,null,null,null,null,null,"6_Implemented"]
[null,null,null,null,null,null,"Push to SQL instead of Access","PushToSQL","No",null,"USERNAME",null,null,null,null,null,"Total",null,null,null,null,null,null,null,null,null,null,null,null,null,null,null,null,null,null,null,null,null,null,null,null,null,null,"5_Documentation",null,null,null,null,null,null,null,null,"51_PlaceHolder"]
[null,null,null,null,null,null,null,null,null,null,"PASSWORD",null,null,null,null,null,null,null,null,null,null,null,null,null,null,null,null,null,null,null,null,null,null,null,"ResetFilter",null,null,null,null,null,null,null,null,"6_Implemented",null,null,null,null,null,null,null,null,"50_none"]
[null,null,null,null,null,null,null,null,null,null,null,null,null,null,null,null,null,null,null,null,null,null,null,null,null,null,null,null,null,null,null,null,null,null,"No",null,null,null,null,null,null,null,null,"51_PlaceHolder",null,null,null,null,null,null,null,null,"97_awaitingClient"]
[null,null,null,null,null,null,null,null,null,null,"COLOROUT",null,null,null,null,null,null,null,null,null,null,null,null,null,null,null,null,null,null,null,null,null,null,null,null,null,null,null,null,null,null,null,null,"50_none",null,null,null,null,null,null,null,null,"98_OfferSent"]
[null,null,null,null,null,null,null,null,null,null,null,null,null,null,null,null,null,null,null,null,null,null,null,null,null,null,"FORMAT","Active User",null,null,null,null,null,null,"ActiveUser",null,null,null,null,null,null,null,null,"97_awaitingClient",null,null,null,null,null,null,null,null,"99_discountinued"]
[null,null,null,null,null,null,null,null,null,null,null,null,null,null,null,null,null,null,null,null,null,null,null,null,null,null,"1_Available","LL",null,null,null,null,null,null,"GA"]
[null,null,null,null,null,null,null,null,null,null,null,null,null,null,null,null,null,null,null,null,null,null,null,null,null,null,"2_Working","    ",null,null,null,null,null,null,null,null,null,null,null,null,null,null,null,"98_done"]
[null,null,null,null,null,null,"This setting is how the import filter is working when it takes data from DB to schedual","AddedBy","Both",null,null,"Status;Date;Both;Any;All",null,null,null,null,null,null,null,null,null,null,null,null,null,null,"3_NotAvailable",null,null,null,null,null,null,null,null,null,null,null,null,null,null,null,null,"99_discountinued"]
[null,null,null,null,null,null,null,null,null,null,null,null,null,null,null,null,null,null,null,null,null,null,null,null,null,null,"4_HolidayRequested"]
[null,null,null,null,null,null,null,null,null,null,null,null,null,null,null,null,null,null,null,null,null,null,null,null,null,null,"41_HolidayApproved"]
[null,null,null,null,null,null,null,null,null,null,null,null,null,null,null,null,null,null,null,null,null,null,null,null,null,null,"42_HolidayDenied"]

{"sheet":"Holiday&Work day","index":9,"n_rows":9,"n_cols":5,"rows_kept":9,"cut":false,"hidden":false,"merged":[[2,1,2,2],[2,3,2,4]]}
[null,"Holiday & Adjusted work day"]
[null,"※Please at \"Date field\" input the correct Date Format \"mm/dd/yyyy\"."]
[null,"Holiday",null,"Adjusted work day"]
[null,"M/D/YY","Holiday name","M/D/YY","Reason"]
[null,"2023-01-01","New Year's Day"]
[null,"2023-12-24","Christmas Eve"]
[null,"2023-12-25","Christmas Day"]
[null,"2023-12-26","Second Day of Christmas"]
[null,"2023-12-31","New Year's Eve"]