{"text_format":"1","workbook":"xlsx","n_sheets":14,"sheets":["EXPORT","IMPORT","Instruction","ResultatRäkning","Compare Budget","Kommentar","DesignTemplate","DB","tmpDB","Admin","ColorChanger","SCBData","ExportTemplate","Notes"],"not_rendered":{"charts":2,"images":4,"macros":1,"external_links":0,"defined_names":30,"comments":0,"pivot_tables":3},"unopened":[],"bounds":{"document_bytes":16777216,"sheet_cells":100000,"rows_first":2000,"rows_last":500,"rows_between":2000,"halvings":0,"cell_chars":16384,"cell_head_chars":4096},"cells_cut":0,"cells_raw":0,"read":"whole","date_system":"1900"}

{"sheet":"EXPORT","index":0,"n_rows":71,"n_cols":36,"rows_kept":71,"cut":false,"hidden":false,"merged":[[3,6,3,9]]}
[]
[null,null,null,null,"Scenarionamn",null,"Initiala Underlag",null,"Password",null,null,null,null,null,null,null,null,null,null,null,null,null,null,null,null,null,"OrganisationNivå1","OrganisationNivå2","OrganisationNivå3","OrganisationNivå4","OrganisationNivå5","VerksamhetensNamn_6","Kategori1","Kategori2","Kategori3"]
[null,null,null,null,null,null,null,null,null,null,null,null,null,null,null,null,null,null,null,null,null,null,"FileName","SheetName","Scenario","Nämnd_1",null,null,null,null,null,null,null,null,null,"Titel"]
[null,null,null,null,"Exportmapp",null,"C:\\Users\\lukas\\OneDrive - XLD Solutions\\Exceldepartment\\Projects\\ProjectFolders\\XLD_ModelTemplates\\BudgetTemplate_Karolinska\\Export231103"]
[]
[]
[]
[null,"Mandatory fields","Mandatory fields","Mandatory fields","Mandatory fields",null,"Frivilliga fält","Optional Fields","Optional Fields","Optional Fields","Optional Fields","Optional Fields",null,null,"Optional Fields","Optional Fields","Optional Fields","Optional Fields",null,"Free fields","Free fields","Free fields"]
[null,"LOCKED","DEFAULT","HIDDEN","LOCKED",null,"OPEN","OPEN","LOCKED","DEFAULT",null,"DEFAULT","DEFAULT","SHOW IF NEEDED","SHOW IF NEEDED","SHOW IF NEEDED","SHOW IF NEEDED","HIDDEN",null,"LOCKED","SHOW IF NEEDED","SHOW IF NEEDED","SHOW IF NEEDED","SHOW IF NEEDED","SHOW IF NEEDED","SHOW IF NEEDED","SHOW IF NEEDED","SHOW IF NEEDED","HIDDEN"]
[null,"FileName","Titel","Datum","Budget Tidigare",null,"Budget","Kommentar","Nämnd _1","VerksamhetensNamn_6",null,"Kategori_1","Kategori_2","Kategori_3","Kategori_4","KST","Anvsvarig","IncomeOrCost","_","BladNamn","Månadslön","Årlig tjänstgöringsgrad","Fakta","OrganisationNivå1","OrganisationNivå2","OrganisationNivå3","OrganisationNivå4","OrganisationNivå5","ImportTime"]
{"$rows_left_out":62}
{"sheet":"IMPORT","index":1,"n_rows":59,"n_cols":10,"rows_kept":59,"cut":false,"hidden":false,"merged":[]}
[]
[null,null,null,null,null,null,null,"Importerat","Scenario","Importerat"]
[null,"Scenarionamn","Preliminär Budget 231103",null,null,null,null,"Finland_Cost.xlsx.xlsx","Preliminär Budget"]
[null,null,null,null,null,null,null,"Finland_Sales.xlsx.xlsx","Preliminär Budget"]
[null,"Mapp att importera","C:\\Users\\lukas\\OneDrive - XLD Solutions\\Exceldepartment\\Projects\\ProjectFolders\\XLD_ModelTemplates\\BudgetTemplate_Karolinska\\Export231103",null,null,null,null,"Sweden_Cost.xlsx.xlsx","Preliminär Budget"]
[null,null,null,null,null,null,null,"Sweden_Sales.xlsx.xlsx","Preliminär Budget"]
[null,"Radera","Data från samma filnamn och scenario",null,null,null,null,"Finland_Cost.xlsx.xlsx","Slutgiltig Budget"]
[null,null,null,null,null,null,null,"Finland_Sales.xlsx.xlsx","Slutgiltig Budget"]
[null,null,null,null,null,null,null,"Sweden_Cost.xlsx.xlsx","Slutgiltig Budget"]
[null,null,null,null,null,null,null,"Sweden_Sales.xlsx.xlsx","Slutgiltig Budget"]
{"$rows_left_out":50}
{"sheet":"Instruction","index":2,"n_rows":16,"n_cols":3,"rows_kept":16,"cut":false,"hidden":false,"merged":[]}
[]
[]
[null,"Instruktion"]
[]
[null,"Scenarionamn:","Välj vilken benämning ni vill ha på filerna som importeras."]
[]
[null,"Mapp att importera","Klicka på knappen och välj i vilken mapp som filerna som skall importeras ligger i."]
[]
[null,"Radera val: ","Allt"]
[null,null,"Raderar allt som finns i DB när man importerar"]
{"$rows_left_out":7}
{"sheet":"ResultatRäkning","index":3,"n_rows":14,"n_cols":8,"rows_kept":14,"cut":false,"hidden":false,"merged":[]}
[]
[]
[]
[]
[]
[]
[null,null,null,"Scenario","Preliminär Budget 231103"]
[null,{"$f":"IF(OR(E7=\"(All)\",E7=\"(Multiple Items)\"),\"Välj endast ett scenario i taget\",\"\")","v":""}]
[null,null,null,"Sum of Budget","Kategori_1"]
[null,null,null,"Nämnd _1","Fastigheter och Inventarier","Material","Personal","Tjänster"]
{"$rows_left_out":5}
{"sheet":"Compare Budget","index":4,"n_rows":55,"n_cols":9,"rows_kept":55,"cut":false,"hidden":false,"merged":[]}
[]
[]
[]
[]
[]
[]
[]
[]
[]
[]
{"$rows_left_out":46}
{"sheet":"Kommentar","index":5,"n_rows":18,"n_cols":8,"rows_kept":18,"cut":false,"hidden":false,"merged":[]}
[]
[]
[]
[]
[]
[]
[null,null,null,"Scenario","Preliminär Budget 231103"]
[null,{"$f":"IF(E7=\"(All)\",\"Välj endast ett scenario i taget\",\"\")","v":""}]
[null,null,null,"Kommentar","Nämnd _1","Titel","FileName","Sum of Budget"]
[null,null,null,"Löneökning",null,null,null,18467360.279999997]
{"$rows_left_out":9}
{"sheet":"DesignTemplate","index":6,"n_rows":16,"n_cols":6,"rows_kept":16,"cut":false,"hidden":true,"merged":[[1,3,1,6]]}
[]
[null,null,"Folder to Import","C:\\Users\\lukas\\OneDrive\\Dokument\\Projects\\Active"]
[]
[null,null,"Complexity-level","1_SuperSimple"]
[]
[]
[]
[]
[]
[null,"_Name","_Status","_Responsible","_Action","Calculations"]
{"$rows_left_out":7}
{"sheet":"DB","index":7,"n_rows":195,"n_cols":51,"rows_kept":195,"cut":false,"hidden":false,"merged":[]}
[]
[]
[null,null,null,null,null,null,null,null,null,null,null,null,null,null,null,null,null,null,null,null,null,null,null,null,null,null,null,null,null,null,null,null,null,null,null,null,null,null,null,null,null,null,null,null,null,null,null,"Default","2020-01-01"]
[]
[]
[]
[]
[]
[null,null,null,null,null,null,null,null,null,null,null,null,null,null,null,null,{"$f":"IFERROR(ABS(P9),\"\")","v":0},{"$f":"IFERROR(IF(H9=\"Costs\",ABS(P9)*-1,ABS(P9)),\"\")","v":0},{"$f":"IFERROR(IF(F9=_xlfn.MAXIFS($F$9:$F$492,$B$9:$B$492,B9),Q9,Q9*-1),\"\")","v":0},null,null,null,null,null,null,null,null,null,null,null,null,null,null,null,null,null,null,null,null,null,null,null,null,null,null,null,null,null,{"$f":"IFERROR(IF(YEAR(AG9)>2000,AG9,$AW$3),$AW$3)","v":43831}]
["FileName","SheetName","Scenario","Organisation","Enhet","ImportTime","Placeholder","IncomeOrCost","SubCategory","Title","Date","Comment","KST","Responsible","ManagersComment","Budget","BudgetPositive","BudgetCostNegative","BudgetChange","Projekt","Lönegrupp","Konto","Konto (Text)","Utfall_Föregående År","Årsbudget_Föregående År","Område","Kategori","Personaltyp","Månadslön","Årlig tjänstgöringsgrad","Fakta","Titel","Datum","Budget Tidigare År","Nämnd _1","VerksamhetensNamn_6","Kategori_1","Kategori_2","Kategori_3","Kategori_4","Anvsvarig","_","BladNamn","OrganisationNivå1","OrganisationNivå2","OrganisationNivå3","OrganisationNivå4","OrganisationNivå5","JusteratDatum","Kommentar","KommentarFinns"]
{"$rows_left_out":186}
{"sheet":"tmpDB","index":8,"n_rows":178,"n_cols":53,"rows_kept":178,"cut":false,"hidden":false,"merged":[]}
[]
[]
[]
[]
[]
[]
["FileName","SheetName","Scenario","Organisation","Unit","ImportTime","Market","IncomeOrCost","SubCategory","Title","Date","Comment","KST","Responsible","ManagersComment","Budget","BudgetPositive","BudgetCostNegative","BudgetChange","_TestNyKolumn","Namn","Befattning","Tjänstgöringsgrad %"," Belopp","Ny lön(lönerev) ","Lönekontering/projekt %","Projekt","Lönegrupp","Antal månader ","LKP vid heltid","Årskst lön/projekt","Årskst LKP/projekt","Lön inkl LKP övriga proj","Kommentarer","Proj","Proj (Text)","Konto","Konto (Text)","Verks","Utfall_Föregående År","Årsbudget_Föregående År","Kommentar","Olle","NyttProjectNo","Område","Belopp","as","ScenarioVar","Kategori","Personaltyp","Månadslön","Årlig tjänstgöringsgrad","Fakta"]
[]
[]
["FileName","SheetName","Scenario","Organisation","Unit","ImportTime","Market","IncomeOrCost","SubCategory","Title","Date","Comment","KST","Responsible","ManagersComment","Budget","BudgetPositive","BudgetCostNegative","BudgetChange","_TestNyKolumn","Namn","Befattning","Tjänstgöringsgrad %"," Belopp","Ny lön(lönerev) ","Lönekontering/projekt %","Projekt","Lönegrupp","Antal månader ","LKP vid heltid","Årskst lön/projekt","Årskst LKP/projekt","Lön inkl LKP övriga proj","Kommentarer","Proj","Proj (Text)","Konto","Konto (Text)","Verks","Utfall_Föregående År","Årsbudget_Föregående År","Kommentar","Olle","NyttProjectNo","Område","Belopp","as","ScenarioVar","Kategori","Personaltyp","Månadslön","Årlig tjänstgöringsgrad","Fakta"]
{"$rows_left_out":169}
{"sheet":"Admin","index":9,"n_rows":375,"n_cols":82,"rows_kept":375,"cut":false,"hidden":false,"merged":[]}
[null,null,null,null,null,null,null,"Settings",null,null,null,null,null,null,null,null,null,null,null,null,null,null,null,null,null,null,null,null,null,null,null,null,null,null,null,null,null,null,null,null,null,null,null,null,null,null,null,null,null,null,null,null,null,null,null,null,null,null,null,null,null,null,null,null,null,null,"Avdelningar"]
[null,null,"Import colors","Data1","Data2",null,null,"Search Rows","Yes",2,null,null,"SheetColor Import",null,"Flikfärg med PivotTabell",null,null,null,null,null,"Projekt","Projektbeskrivning",null,null,null,"Exkluderade Konton",null,null,"Budgetår",null,null,"Enhet","Enhfor(T)","Proj","Proj(T)","Verksamhetskod",null,null,null,null,null,null,null,"Konto","KontoGrupp1","KontoGrupp2","Kontogrupp3","KontogruppÖvergripande",null,null,null,null,null,null,"ImportScenario",null,null,"RaderaScenario","RaderaScenarioNo",null,"Flikfärg Export",null,null,null,"Rubriker",null,"Enhet","Avdelning",null,"Projekt","AdminProjekt",null,"Verksamhetskod","Verksamhetsnamn",null,"Avskrivningskonto","Avskrivning",null,"FinansKostn.Konton","Finansiella Kostnader",null,"Costs are Always negative"]
[null,null,null,"Ref",null,null,null,"Search Columns","No",3,null,null,null,null,null,null,null,null,null,null,"Projekt 1","Kund nr 1",null,null,null,4011,null,null,2020,null,null,"OV161","Kliniken för barn- och ungdomstandvård","OV16101131","Tandvård/statsanslag",120,null,null,null,null,null,null,null,40,null,"","",null,null,null,null,null,null,null,"Initiala Underlag",null,null,"Allt",1,null,null,null,null,null,"Utfall",null,"OF121","OF120",null,"OF82008001","Administration",null,102,"Tandläkarprogrammet",null,6911,"Avskrivningar maskiner, inventarier mm (3år, 5år eller 10 år)",null,5911,"Räntekostnader RGK, statliga",null,5911]
[null,null,null,"Title",null,null,null,"Search for Ref","No",4,null,null,null,null,null,null,null,null,null,null,"Projekt 2","Kund nr 2",null,null,null,4015,null,null,null,null,null,"OV161","Kliniken för barn- och ungdomstandvård","OV16101716","SLL-avtal",64,null,null,null,null,null,null,null,49,null,"","",null,null,null,null,null,null,null,"Preliminär Budget",null,null,"Allt med samma scenario",2,null,null,null,null,null,"Årsbudget",null,"OF131","OF120",null,"OF82008002","Administration",null,110,"Fristående kurser",null,6916,"Avskrivning immateriella tillgångar (5år)",null,5921,"Dröjsmålsräntor statliga myndigheter",null,5921]
[null,null,null,"Statisk Data",null,null,null,"WriteToLocalDB","Yes",5,null,null,null,null,null,null,null,null,null,null,"Projekt 3","Kund nr 3",null,null,null,4060,null,null,null,null,null,"OV161","Kliniken för barn- och ungdomstandvård","OV16101746","Barnmedicin 1",64,null,null,null,null,null,null,null,50,null,"","",null,null,null,null,null,null,null,"Slutgiltig Budget",null,null,"Data från samma filnamn och scenario",3,null,null,null,null,null," Rak prognos",null,"OF112","OF140",null,"OF83008001","Ekonomi",null,120,"Tandvård",null,6917,"Avskrivning förbättringsutgift annans fastighet",null,5922,"Dröjsmålsräntor utomstatliga",null,5922]
[null,null,null,"Data från master",null,null,null,"ClearDataBase",{"$f":"INDEX($BF:$BG,MATCH(IMPORT!$C$7,$BF:$BF,0),2)","v":3},6,null,null,null,null,null,null,null,null,null,null,"Projekt 4","Kund nr 4",null,null,null,4062,null,null,null,null,null,"OV171","Kliniken för tandreglering","OV17101131","Tandvård/statsanslag",120,null,null,null,null,null,null,null,57,null,"","",null,null,null,null,null,null,null,null,null,null,null,null,null,null,null,null,null,"Stängd",null,"OF141","OF140",null,"OF83008002","Ekonomi",null,127,"Påbyggnadsutbildning i odontologisk profylaktik",null,69901,"Omkontering avskrivningskostnader",null,5962,"Kursförluster valuta, utomstatliga"]
[null,null,null,null,null,null,null,"AddNewTitles","Yes",7,null,null,null,null,null,null,null,null,null,null,"Projekt 5","Kund nr 5",null,null,null,null,null,null,null,null,null,"OV171","Kliniken för tandreglering","OV17101556","Tandtekniska laboratoriet",64,null,null,null,null,null,null,null,69,null,"","",null,null,null,null,null,null,null,null,null,null,null,null,null,null,null,null,null,null,null,"OF161","OF160",null,"OF83008011","Personal",null,135,"Tandhygienistprogrammet",null,null,null,null,5991,"Övriga finansiella kostnader, statliga myndigheter"]
[null,null,null,null,null,null,null,"Titles row in DB-sheet",10,8,null,null,null,null,null,null,null,null,null,null,"Projekt 6","Kund nr 6",null,null,null,null,null,null,null,null,null,"OV171","Kliniken för tandreglering","OV17101705","Genetik ST/PG",532,null,null,null,null,null,null,null,338,null,"Intäkter av avgifter","Intäkter av avgifter","Verksamhetens intäkter",null,null,null,null,null,null,null,null,null,null,null,null,null,null,null,null,null,null,"OF171","OF160",null,"OF83008012","Personal",null,18,"Stödverksamhet GU",null,null,null,null,5992,"Övriga finansiella kostnader, utomstatliga"]
[null,null,null,null,null,null,null,"CheckPrevious","No",9,null,null,null,null,null,null,null,null,null,null,null,null,null,null,null,null,null,null,null,null,null,"OV171","Kliniken för tandreglering","OV17101716","SLL-avtal",64,null,null,null,null,null,null,null,339,null,"Intäkter av avgifter","Intäkter av avgifter","Verksamhetens intäkter",null,null,null,null,null,null,null,null,null,null,null,null,null,null,null,null,null,null,null,null,null,"OF84008001","Service & Underhåll",null,190,"Övrig grundutbildning",null,null,null,null,59998,"Inst intern finansiell kostnad"]
[null,null,null,null,null,null,null,"UploadToAccess","No",10,null,null,null,null,null,null,null,null,null,null,null,null,null,null,null,null,null,null,null,null,null,"OV171","Kliniken för tandreglering","OV17101916","ST/PG-utbildning 2019--",64,null,null,null,null,null,null,null,358,null,"Intäkter av bidrag","Intäkter av bidrag","Verksamhetens intäkter",null,null,null,null,null,null,null,null,null,null,null,null,null,null,null,null,null,null,null,null,null,"OF84008002","Service & Underhåll",null,41,"Externa bidrag grundutbildning",null,null,null,null,59999,"Finansiell kostnad (KI-intern faktura)"]
{"$rows_left_out":366}
{"sheet":"ColorChanger","index":10,"n_rows":39,"n_cols":19,"rows_kept":39,"cut":false,"hidden":false,"merged":[[9,11,9,12],[10,11,10,12],[11,11,11,12],[12,11,12,12],[13,11,13,12]]}
[]
[]
[]
[]
[]
[]
[]
[]
[]
[null,null,null,null,null,null,null,null,null,null,null,"Graph Types"]
{"$rows_left_out":30}
{"sheet":"SCBData","index":11,"n_rows":75,"n_cols":32,"rows_kept":75,"cut":false,"hidden":false,"merged":[]}
["Bruttokostnad i tkr, löpande priser efter region, verksamhetsområde och år"]
[]
["region","verksamhetsområde",2018,2019,2020,null,null,null,null,null,null,null,"Lärare 1","2021-01-01",{"$f":"AE3*1.325*12*AF3/100","v":458556},null,null,"PEDAGOGISK VERKSAMHET","Grönkullaskolan",null,"Personal","Cost","Grundskola","Lärare",null,null,null,null,null,null,{"$f":"28000*(RANDBETWEEN(90,110)/100)","v":28840},100]
["2505 Arvidsjaur","POLITISK VERKSAMHET, TOTALT",8467,8592,"..",null,{"$f":"IF(RIGHT(B4,6)=\"TOTALT\",0,D4)","v":0},{"$f":"IF(RIGHT(B4,6)=\"TOTALT\",LEFT(B4,LEN(B4)-8),H3)","v":"POLITISK VERKSAMHET"},null,null,null,null,"Lärare 2","2021-01-01",{"$f":"AE4*1.325*12*AF4/100","v":489720},null,null,"PEDAGOGISK VERKSAMHET","Grönkullaskolan",null,"Personal","Cost","Grundskola","Lärare",null,null,null,null,null,null,30800.000000000004,100]
["2505 Arvidsjaur","Nämnd- och styrelseverksamhet",6678,6384,"..",null,{"$f":"IF(RIGHT(B5,6)=\"TOTALT\",0,D5)","v":6384},{"$f":"IF(RIGHT(B5,6)=\"TOTALT\",LEFT(B5,LEN(B5)-8),H4)","v":"POLITISK VERKSAMHET"},null,null,null,null,"Lärare 3","2021-01-01",463008,null,null,"PEDAGOGISK VERKSAMHET","Grönkullaskolan",null,"Personal","Cost","Grundskola","Lärare",null,null,null,null,null,null,29120,100]
["2505 Arvidsjaur","Stöd till politiska partier",546,558,"..",null,558,"POLITISK VERKSAMHET",null,null,null,null,"Lärare 4","2021-01-01",431844,null,null,"PEDAGOGISK VERKSAMHET","Grönkullaskolan",null,"Personal","Cost","Grundskola","Lärare",null,null,null,null,null,null,27160,100]
["2505 Arvidsjaur","Revision",285,667,"..",null,667,"POLITISK VERKSAMHET",null,null,null,null,"Lärare 5","2021-01-01",471912,null,null,"PEDAGOGISK VERKSAMHET","Grönkullaskolan",null,"Personal","Cost","Grundskola","Lärare",null,null,null,null,null,null,29680,100]
["2505 Arvidsjaur","Övrig politisk verksamhet ",958,983,"..",null,983,"POLITISK VERKSAMHET",null,null,null,null,"Lärare 6","2021-01-01",458556,null,null,"PEDAGOGISK VERKSAMHET","Grönkullaskolan",null,"Personal","Cost","Grundskola","Lärare",null,null,null,null,null,null,28840,100]
["2505 Arvidsjaur","INFRASTRUKTUR, SKYDD mm, TOTALT",51431,53644,"..",null,0,"INFRASTRUKTUR, SKYDD mm",null,null,null,null,"Lärare 7","2021-01-01",422940,null,null,"PEDAGOGISK VERKSAMHET","Grönkullaskolan",null,"Personal","Cost","Grundskola","Lärare",null,null,null,null,null,null,26600,100]
["2505 Arvidsjaur","Fysisk och teknisk planering, bostadsförbättring",9115,9335,"..",null,9335,"INFRASTRUKTUR, SKYDD mm",null,null,null,null,"Lärare 8","2021-01-01",454104,null,null,"PEDAGOGISK VERKSAMHET","Grönkullaskolan",null,"Personal","Cost","Grundskola","Lärare",null,null,null,null,null,null,28560,100]
{"$rows_left_out":66}
{"sheet":"ExportTemplate","index":12,"n_rows":9,"n_cols":5,"rows_kept":9,"cut":false,"hidden":false,"merged":[]}
[]
[]
[]
[]
[]
[]
[]
[]
[null,null,null,null,{"$f":"SUBTOTAL(9,$E$11:$E$300)","v":0}]

{"sheet":"Notes","index":13,"n_rows":9,"n_cols":3,"rows_kept":9,"cut":false,"hidden":true,"merged":[]}
[]
[]
[]
[]
[]
[null,null,240]
[null,null,180]
[null,null,120]
[null,null,60]